BDBM21926 8-bromo-4-[(3-chloro-4-fluorophenyl)amino]-6-[({1-[3-(dimethylamino)propyl]-1H-1,2,3-triazol-4-yl}methyl)amino]quinoline-3-carbonitrile::Cyanoquinoline, 55
SMILES: CN(C)CCCn1cc(CNc2cc(Br)c3ncc(C#N)c(Nc4ccc(F)c(Cl)c4)c3c2)nn1
InChI Key: InChIKey=RUCXDAGQSXXFMK-UHFFFAOYSA-N
Data: 2 IC50
Activity Spreadsheet -- Enzyme Inhibition Constant Data from BindingDB
Found 2 hits for monomerid = 21926
Trg + Lig
Ki
nM
ΔG°
kcal/mole
IC50
nM
Kd
nM
EC50/IC50
nM
koff
s-1
kon
M-1s-1
pHTemp
°C
Epidermal growth factor receptor
(Homo sapiens (Human))
BDBM21926
(8-bromo-4-[(3-chloro-4-fluorophenyl)amino]-6-[({1-...)
Show SMILES CN(C)CCCn1cc(CNc2cc(Br)c3ncc(C#N)c(Nc4ccc(F)c(Cl)c4)c3c2)nn1
Show InChI InChI=1S/C24H23BrClFN8/c1-34(2)6-3-7-35-14-18(32-33-35)13-29-17-8-19-23(31-16-4-5-22(27)21(26)10-16)15(11-28)12-30-24(19)20(25)9-17/h4-5,8-10,12,14,29H,3,6-7,13H2,1-2H3,(H,30,31)
n/an/a>5.00E+3n/an/an/an/an/an/a
Wyeth Research
Assay Description
EGFR kinase activity was assayed using poly(Glu4-Tyr) as a substrate. The phosphorylation of tyrosine residue was detected by an ELISA. IC50 calculat...
J Med Chem 50: 4728-45 (2007)
Article DOI: 10.1021/jm070436q
BindingDB Entry DOI: 10.7270/Q2891441
Mitogen-activated protein kinase kinase kinase 8
(Homo sapiens (Human))
BDBM21926
(8-bromo-4-[(3-chloro-4-fluorophenyl)amino]-6-[({1-...)
Show SMILES CN(C)CCCn1cc(CNc2cc(Br)c3ncc(C#N)c(Nc4ccc(F)c(Cl)c4)c3c2)nn1
Show InChI InChI=1S/C24H23BrClFN8/c1-34(2)6-3-7-35-14-18(32-33-35)13-29-17-8-19-23(31-16-4-5-22(27)21(26)10-16)15(11-28)12-30-24(19)20(25)9-17/h4-5,8-10,12,14,29H,3,6-7,13H2,1-2H3,(H,30,31)
NCI pathway
Reactome pathway
n/an/a 20n/an/an/an/an/an/a
Wyeth Research
Assay Description
Tpl2/Cot activity was directly assayed using GST-MEK1 as a substrate. The phosphorylation on serine residues was detected by an ELISA. IC50 calculati...
J Med Chem 50: 4728-45 (2007)
Article DOI: 10.1021/jm070436q
BindingDB Entry DOI: 10.7270/Q2891441