BDBM21931 Cyanoquinoline, 42::methyl 5-[({8-bromo-4-[(3-chloro-4-fluorophenyl)amino]-3-cyanoquinolin-6-yl}amino)methyl]-1H-imidazole-4-carboxylate
SMILES: COC(=O)c1nc[nH]c1CNc1cc(Br)c2ncc(C#N)c(Nc3ccc(F)c(Cl)c3)c2c1
InChI Key: InChIKey=QUQCOBXUNWWUSB-UHFFFAOYSA-N
Data: 1 IC50
Activity Spreadsheet -- Enzyme Inhibition Constant Data from BindingDB
Found 1 hit for monomerid = 21931
Trg + Lig
Ki
nM
ΔG°
kcal/mole
IC50
nM
Kd
nM
EC50/IC50
nM
koff
s-1
kon
M-1s-1
pHTemp
°C
Mitogen-activated protein kinase kinase kinase 8
(Homo sapiens (Human))
BDBM21931
(Cyanoquinoline, 42 | methyl 5-[({8-bromo-4-[(3-chl...)
Show SMILES COC(=O)c1nc[nH]c1CNc1cc(Br)c2ncc(C#N)c(Nc3ccc(F)c(Cl)c3)c2c1
Show InChI InChI=1S/C22H15BrClFN6O2/c1-33-22(32)21-18(29-10-30-21)9-27-13-4-14-19(31-12-2-3-17(25)16(24)6-12)11(7-26)8-28-20(14)15(23)5-13/h2-6,8,10,27H,9H2,1H3,(H,28,31)(H,29,30)
NCI pathway
Reactome pathway
n/an/a 87n/an/an/an/an/an/a
Wyeth Research
Assay Description
Tpl2/Cot activity was directly assayed using GST-MEK1 as a substrate. The phosphorylation on serine residues was detected by an ELISA. IC50 calculati...
J Med Chem 50: 4728-45 (2007)
Article DOI: 10.1021/jm070436q
BindingDB Entry DOI: 10.7270/Q2891441