BDBM21935 8-chloro-4-[(3-chloro-4-fluorophenyl)amino]-6-{[(2,5-dimethyl-1H-imidazol-4-yl)methyl]amino}quinoline-3-carbonitrile::Cyanoquinoline, 46
SMILES: Cc1nc(C)c(CNc2cc(Cl)c3ncc(C#N)c(Nc4ccc(F)c(Cl)c4)c3c2)[nH]1
InChI Key: InChIKey=GNHATMYSTQLMPW-UHFFFAOYSA-N
Data: 1 IC50
Activity Spreadsheet -- Enzyme Inhibition Constant Data from BindingDB
Found 1 hit for monomerid = 21935
Trg + Lig
Ki
nM
ΔG°
kcal/mole
IC50
nM
Kd
nM
EC50/IC50
nM
koff
s-1
kon
M-1s-1
pHTemp
°C
Mitogen-activated protein kinase kinase kinase 8
(Homo sapiens (Human))
BDBM21935
(8-chloro-4-[(3-chloro-4-fluorophenyl)amino]-6-{[(2...)
Show SMILES Cc1nc(C)c(CNc2cc(Cl)c3ncc(C#N)c(Nc4ccc(F)c(Cl)c4)c3c2)[nH]1
Show InChI InChI=1S/C22H17Cl2FN6/c1-11-20(30-12(2)29-11)10-27-15-5-16-21(31-14-3-4-19(25)17(23)6-14)13(8-26)9-28-22(16)18(24)7-15/h3-7,9,27H,10H2,1-2H3,(H,28,31)(H,29,30)
NCI pathway
Reactome pathway
n/an/a 220n/an/an/an/an/an/a
Wyeth Research
Assay Description
Tpl2/Cot activity was directly assayed using GST-MEK1 as a substrate. The phosphorylation on serine residues was detected by an ELISA. IC50 calculati...
J Med Chem 50: 4728-45 (2007)
Article DOI: 10.1021/jm070436q
BindingDB Entry DOI: 10.7270/Q2891441