BDBM21936 8-chloro-4-[(3-chloro-4-fluorophenyl)amino]-6-{[(1-methyl-1H-imidazol-5-yl)methyl]amino}quinoline-3-carbonitrile::Cyanoquinoline, 47
SMILES: Cn1cncc1CNc1cc(Cl)c2ncc(C#N)c(Nc3ccc(F)c(Cl)c3)c2c1
InChI Key: InChIKey=RRBDDKXQELPXIB-UHFFFAOYSA-N
Data: 1 IC50
Activity Spreadsheet -- Enzyme Inhibition Constant Data from BindingDB
Found 1 hit for monomerid = 21936
Trg + Lig
Ki
nM
ΔG°
kcal/mole
IC50
nM
Kd
nM
EC50/IC50
nM
koff
s-1
kon
M-1s-1
pHTemp
°C
Mitogen-activated protein kinase kinase kinase 8
(Homo sapiens (Human))
BDBM21936
(8-chloro-4-[(3-chloro-4-fluorophenyl)amino]-6-{[(1...)
Show SMILES Cn1cncc1CNc1cc(Cl)c2ncc(C#N)c(Nc3ccc(F)c(Cl)c3)c2c1
Show InChI InChI=1S/C21H15Cl2FN6/c1-30-11-26-9-15(30)10-27-14-4-16-20(29-13-2-3-19(24)17(22)5-13)12(7-25)8-28-21(16)18(23)6-14/h2-6,8-9,11,27H,10H2,1H3,(H,28,29)
NCI pathway
Reactome pathway
n/an/a 220n/an/an/an/an/an/a
Wyeth Research
Assay Description
Tpl2/Cot activity was directly assayed using GST-MEK1 as a substrate. The phosphorylation on serine residues was detected by an ELISA. IC50 calculati...
J Med Chem 50: 4728-45 (2007)
Article DOI: 10.1021/jm070436q
BindingDB Entry DOI: 10.7270/Q2891441