BDBM22005 5-(cyclobutylsulfanyl)-3-methyl-1-(2-methylpropyl)-6-{[2-(trifluoromethyl)phenyl]methyl}-1H,2H,3H,4H-thieno[2,3-d]pyrimidine-2,4-dione::Thieno[2,3-d]pyrimidine-2,4(1H,3H)-dione, 12
SMILES: CC(C)Cn1c2sc(Cc3ccccc3C(F)(F)F)c(SC3CCC3)c2c(=O)n(C)c1=O
InChI Key: InChIKey=GUAPZNRGDUSXHS-UHFFFAOYSA-N
Data: 1 KI
Activity Spreadsheet -- Enzyme Inhibition Constant Data from BindingDB
Found 1 hit for monomerid = 22005
Trg + Lig
Ki
nM
ΔG°
kcal/mole
IC50
nM
Kd
nM
EC50/IC50
nM
koff
s-1
kon
M-1s-1
pHTemp
°C
Monocarboxylate Transporter 1
(Homo sapiens (Human))
BDBM22005
(5-(cyclobutylsulfanyl)-3-methyl-1-(2-methylpropyl)...)
Show SMILES CC(C)Cn1c2sc(Cc3ccccc3C(F)(F)F)c(SC3CCC3)c2c(=O)n(C)c1=O
Show InChI InChI=1S/C23H25F3N2O2S2/c1-13(2)12-28-21-18(20(29)27(3)22(28)30)19(31-15-8-6-9-15)17(32-21)11-14-7-4-5-10-16(14)23(24,25)26/h4-5,7,10,13,15H,6,8-9,11-12H2,1-3H3
Reactome pathway
13 -10.6n/an/an/an/an/a7.822
AstraZeneca
Assay Description
Jurkat cell membranes were incubated with [3H]-labeled ligand in the absence or presence of increasing concentrations of test compound. The reagents ...
Bioorg Med Chem Lett 16: 2260-5 (2006)
Article DOI: 10.1016/j.bmcl.2006.01.024
BindingDB Entry DOI: 10.7270/Q2C24TQK