null
SMILES: Cn1cc(-c2cc(ccc2Oc2ccccc2)C(N)=O)c2cc[nH]c2c1=O
InChI Key: InChIKey=CSZKWGRFCCGFSN-UHFFFAOYSA-N
Activity Spreadsheet -- Enzyme Inhibition Constant Data from BindingDB
Found 4 hits for monomerid = 220430
Trg + Lig
Ki
nM
ΔG°
kcal/mole
IC50
nM
Kd
nM
EC50/IC50
nM
koff
s-1
kon
M-1s-1
pHTemp
°C
Bromodomain-containing protein 4 [57-168]
(Homo sapiens (Human))
BDBM220430
(US9296741, 19)
Show SMILES Cn1cc(-c2cc(ccc2Oc2ccccc2)C(N)=O)c2cc[nH]c2c1=O
Show InChI InChI=1S/C21H17N3O3/c1-24-12-17(15-9-10-23-19(15)21(24)26)16-11-13(20(22)25)7-8-18(16)27-14-5-3-2-4-6-14/h2-12,23H,1H3,(H2,22,25)
US Patent
7.40 -11.1n/an/an/an/an/a6.025
AbbVie Inc.
US Patent
Assay Description
A time-resolved fluorescence resonance energy transfer (TR-FRET) assay was used to determine the affinities of compounds of the Examples listed in Ta...
US Patent US9296741 (2016)
BindingDB Entry DOI: 10.7270/Q26W98ZQ
Bromodomain-containing protein 4
(Homo sapiens (Human))
BDBM220430
(US9296741, 19)
Show SMILES Cn1cc(-c2cc(ccc2Oc2ccccc2)C(N)=O)c2cc[nH]c2c1=O
Show InChI InChI=1S/C21H17N3O3/c1-24-12-17(15-9-10-23-19(15)21(24)26)16-11-13(20(22)25)7-8-18(16)27-14-5-3-2-4-6-14/h2-12,23H,1H3,(H2,22,25)
14n/an/an/an/an/an/an/an/a
AbbVie Inc.
Curated by ChEMBL
Assay Description
Inhibition of ADP-induced platelet aggregation in human platelet-rich plasma
J Med Chem 60: 8369-8384 (2017)
Article DOI: 10.1021/acs.jmedchem.7b00746
BindingDB Entry DOI: 10.7270/Q2251MB8
Bromodomain-containing protein 4
(Homo sapiens (Human))
BDBM220430
(US9296741, 19)
Show SMILES Cn1cc(-c2cc(ccc2Oc2ccccc2)C(N)=O)c2cc[nH]c2c1=O
Show InChI InChI=1S/C21H17N3O3/c1-24-12-17(15-9-10-23-19(15)21(24)26)16-11-13(20(22)25)7-8-18(16)27-14-5-3-2-4-6-14/h2-12,23H,1H3,(H2,22,25)
n/an/an/an/a 71n/an/an/an/a
AbbVie Inc.
Curated by ChEMBL
Assay Description
Inhibition of ADP-induced platelet aggregation in human platelet-rich plasma
J Med Chem 60: 8369-8384 (2017)
Article DOI: 10.1021/acs.jmedchem.7b00746
BindingDB Entry DOI: 10.7270/Q2251MB8
Bromodomain-containing protein 4 [352-457]
(Homo sapiens (Human))
BDBM220430
(US9296741, 19)
Show SMILES Cn1cc(-c2cc(ccc2Oc2ccccc2)C(N)=O)c2cc[nH]c2c1=O
Show InChI InChI=1S/C21H17N3O3/c1-24-12-17(15-9-10-23-19(15)21(24)26)16-11-13(20(22)25)7-8-18(16)27-14-5-3-2-4-6-14/h2-12,23H,1H3,(H2,22,25)
NCI pathway
Reactome pathway
US Patent
4.20 -11.4n/an/an/an/an/a6.025
AbbVie Inc.
US Patent
Assay Description
A time-resolved fluorescence resonance energy transfer (TR-FRET) assay was used to determine the affinities of compounds of the Examples listed in Ta...
US Patent US9296741 (2016)
BindingDB Entry DOI: 10.7270/Q26W98ZQ