BDBM22048 9-benzyl-6-{[(2S)-2-methylbutyl]amino}-9H-purine-2-carbonitrile::Compound 3{1,17}
SMILES: CC[C@H](C)CNc1nc(nc2n(Cc3ccccc3)cnc12)C#N
InChI Key: InChIKey=GNSCEXSWZIAABK-ZDUSSCGKSA-N
Data: 1 IC50
Activity Spreadsheet -- Enzyme Inhibition Constant Data from BindingDB
Found 1 hit for monomerid = 22048
Trg + Lig
Ki
nM
ΔG°
kcal/mole
IC50
nM
Kd
nM
EC50/IC50
nM
koff
s-1
kon
M-1s-1
pHTemp
°C
Cathepsin B-Like Cysteine Protease (TbcatB)
(Trypanosoma brucei)
BDBM22048
(9-benzyl-6-{[(2S)-2-methylbutyl]amino}-9H-purine-2...)
Show SMILES CC[C@H](C)CNc1nc(nc2n(Cc3ccccc3)cnc12)C#N |r|
Show InChI InChI=1S/C18H20N6/c1-3-13(2)10-20-17-16-18(23-15(9-19)22-17)24(12-21-16)11-14-7-5-4-6-8-14/h4-8,12-13H,3,10-11H2,1-2H3,(H,20,22,23)/t13-/m0/s1
n/an/a 5.00E+3n/an/an/an/a5.522
University of California at San Francisco
Assay Description
Enzyme activity was assayed in a 96-well plate format. TbcatB was incubated with inhibitor compound at room temperature for 20 min before the additio...
J Med Chem 51: 545-52 (2008)
Article DOI: 10.1021/jm070760l
BindingDB Entry DOI: 10.7270/Q2V40SH0