BDBM220496 US9296741, 85
SMILES: Cn1cc(-c2cc(ccc2Oc2ccccc2)S(C)(=O)=O)c2cc[nH]c2c1=O
InChI Key: InChIKey=CGASLGCHTWREOZ-UHFFFAOYSA-N
Data: 3 KI  1 EC50
Activity Spreadsheet -- Enzyme Inhibition Constant Data from BindingDB
Found 4 hits for monomerid = 220496
Trg + Lig
Ki
nM
ΔG°
kcal/mole
IC50
nM
Kd
nM
EC50/IC50
nM
koff
s-1
kon
M-1s-1
pHTemp
°C
Bromodomain-containing protein 4 (BRD4)(aa 352-457)
(Homo sapiens (Human))
BDBM220496
(US9296741, 85)
Show SMILES Cn1cc(-c2cc(ccc2Oc2ccccc2)S(C)(=O)=O)c2cc[nH]c2c1=O
Show InChI InChI=1S/C21H18N2O4S/c1-23-13-18(16-10-11-22-20(16)21(23)24)17-12-15(28(2,25)26)8-9-19(17)27-14-6-4-3-5-7-14/h3-13,22H,1-2H3
NCI pathway
Reactome pathway
US Patent
1.70 -12.0n/an/an/an/an/a6.025
AbbVie Inc.
US Patent
Assay Description
A time-resolved fluorescence resonance energy transfer (TR-FRET) assay was used to determine the affinities of compounds of the Examples listed in Ta...
US Patent US9296741 (2016)
BindingDB Entry DOI: 10.7270/Q26W98ZQ
Bromodomain-containing protein 4
(Homo sapiens (Human))
BDBM220496
(US9296741, 85)
Show SMILES Cn1cc(-c2cc(ccc2Oc2ccccc2)S(C)(=O)=O)c2cc[nH]c2c1=O
Show InChI InChI=1S/C21H18N2O4S/c1-23-13-18(16-10-11-22-20(16)21(23)24)17-12-15(28(2,25)26)8-9-19(17)27-14-6-4-3-5-7-14/h3-13,22H,1-2H3
5.80n/an/an/an/an/an/an/an/a
AbbVie Inc.
Curated by ChEMBL
Assay Description
Compound was tested in vitro for its inhibitory activity against human placental aldose reductase
J Med Chem 60: 8369-8384 (2017)
Article DOI: 10.1021/acs.jmedchem.7b00746
BindingDB Entry DOI: 10.7270/Q2251MB8
Bromodomain-containing protein 4 (BRD4)(aa 57-168)
(Homo sapiens (Human))
BDBM220496
(US9296741, 85)
Show SMILES Cn1cc(-c2cc(ccc2Oc2ccccc2)S(C)(=O)=O)c2cc[nH]c2c1=O
Show InChI InChI=1S/C21H18N2O4S/c1-23-13-18(16-10-11-22-20(16)21(23)24)17-12-15(28(2,25)26)8-9-19(17)27-14-6-4-3-5-7-14/h3-13,22H,1-2H3
US Patent
6.40 -11.2n/an/an/an/an/a6.025
AbbVie Inc.
US Patent
Assay Description
A time-resolved fluorescence resonance energy transfer (TR-FRET) assay was used to determine the affinities of compounds of the Examples listed in Ta...
US Patent US9296741 (2016)
BindingDB Entry DOI: 10.7270/Q26W98ZQ
Bromodomain-containing protein 4
(Homo sapiens (Human))
BDBM220496
(US9296741, 85)
Show SMILES Cn1cc(-c2cc(ccc2Oc2ccccc2)S(C)(=O)=O)c2cc[nH]c2c1=O
Show InChI InChI=1S/C21H18N2O4S/c1-23-13-18(16-10-11-22-20(16)21(23)24)17-12-15(28(2,25)26)8-9-19(17)27-14-6-4-3-5-7-14/h3-13,22H,1-2H3
n/an/an/an/a 50n/an/an/an/a
AbbVie Inc.
Curated by ChEMBL
Assay Description
Inhibition of BRD4 in human H1299 cells assessed as decrease in HPV LCR-E2-EP400-mediated transcriptional repression after 24 hrs by Bright-Glo lucif...
J Med Chem 60: 8369-8384 (2017)
Article DOI: 10.1021/acs.jmedchem.7b00746
BindingDB Entry DOI: 10.7270/Q2251MB8