BDBM220552 US9296741, 141
SMILES: CCS(=O)(=O)Nc1ccc(Oc2cncnc2)c(c1)-c1cn(C)c(=O)c2[nH]ccc12
InChI Key: InChIKey=XAARGHYZIMMIKR-UHFFFAOYSA-N
Data: 3 KI  1 EC50
Activity Spreadsheet -- Enzyme Inhibition Constant Data from BindingDB
Found 4 hits for monomerid = 220552
Trg + Lig
Ki
nM
ΔG°
kcal/mole
IC50
nM
Kd
nM
EC50/IC50
nM
koff
s-1
kon
M-1s-1
pHTemp
°C
Bromodomain-containing protein 4 (BRD4)(aa 57-168)
(Homo sapiens (Human))
BDBM220552
(US9296741, 141)
Show SMILES CCS(=O)(=O)Nc1ccc(Oc2cncnc2)c(c1)-c1cn(C)c(=O)c2[nH]ccc12
Show InChI InChI=1S/C20H19N5O4S/c1-3-30(27,28)24-13-4-5-18(29-14-9-21-12-22-10-14)16(8-13)17-11-25(2)20(26)19-15(17)6-7-23-19/h4-12,23-24H,3H2,1-2H3
US Patent
5.40 -11.3n/an/an/an/an/a6.025
AbbVie Inc.
US Patent
Assay Description
A time-resolved fluorescence resonance energy transfer (TR-FRET) assay was used to determine the affinities of compounds of the Examples listed in Ta...
US Patent US9296741 (2016)
BindingDB Entry DOI: 10.7270/Q26W98ZQ
Bromodomain-containing protein 4 (BRD4)(aa 352-457)
(Homo sapiens (Human))
BDBM220552
(US9296741, 141)
Show SMILES CCS(=O)(=O)Nc1ccc(Oc2cncnc2)c(c1)-c1cn(C)c(=O)c2[nH]ccc12
Show InChI InChI=1S/C20H19N5O4S/c1-3-30(27,28)24-13-4-5-18(29-14-9-21-12-22-10-14)16(8-13)17-11-25(2)20(26)19-15(17)6-7-23-19/h4-12,23-24H,3H2,1-2H3
NCI pathway
Reactome pathway
US Patent
15.2 -10.7n/an/an/an/an/a6.025
AbbVie Inc.
US Patent
Assay Description
A time-resolved fluorescence resonance energy transfer (TR-FRET) assay was used to determine the affinities of compounds of the Examples listed in Ta...
US Patent US9296741 (2016)
BindingDB Entry DOI: 10.7270/Q26W98ZQ
Bromodomain-containing protein 4
(Homo sapiens (Human))
BDBM220552
(US9296741, 141)
Show SMILES CCS(=O)(=O)Nc1ccc(Oc2cncnc2)c(c1)-c1cn(C)c(=O)c2[nH]ccc12
Show InChI InChI=1S/C20H19N5O4S/c1-3-30(27,28)24-13-4-5-18(29-14-9-21-12-22-10-14)16(8-13)17-11-25(2)20(26)19-15(17)6-7-23-19/h4-12,23-24H,3H2,1-2H3
32n/an/an/an/an/an/an/an/a
AbbVie Inc.
Curated by ChEMBL
Assay Description
Binding affinity to human N-terminal His6-tagged BRD4 BD1-BD2 (K57 to K550 residues) after 1 hr using alexa-647 conjugated probe by TR-FRET assay
J Med Chem 60: 8369-8384 (2017)
Article DOI: 10.1021/acs.jmedchem.7b00746
BindingDB Entry DOI: 10.7270/Q2251MB8
Bromodomain-containing protein 4
(Homo sapiens (Human))
BDBM220552
(US9296741, 141)
Show SMILES CCS(=O)(=O)Nc1ccc(Oc2cncnc2)c(c1)-c1cn(C)c(=O)c2[nH]ccc12
Show InChI InChI=1S/C20H19N5O4S/c1-3-30(27,28)24-13-4-5-18(29-14-9-21-12-22-10-14)16(8-13)17-11-25(2)20(26)19-15(17)6-7-23-19/h4-12,23-24H,3H2,1-2H3
n/an/an/an/a 170n/an/an/an/a
AbbVie Inc.
Curated by ChEMBL
Assay Description
Inhibition of BRD4 in human H1299 cells assessed as decrease in HPV LCR-E2-EP400-mediated transcriptional repression after 24 hrs by Bright-Glo lucif...
J Med Chem 60: 8369-8384 (2017)
Article DOI: 10.1021/acs.jmedchem.7b00746
BindingDB Entry DOI: 10.7270/Q2251MB8