BDBM22062 9-(cyclohexylmethyl)-6-{[(3-methylphenyl)methyl]amino}-9H-purine-2-carbonitrile::Compound 3{7,15}
SMILES: Cc1cccc(CNc2nc(nc3n(CC4CCCCC4)cnc23)C#N)c1
InChI Key: InChIKey=DYRCMJNRMRURAG-UHFFFAOYSA-N
Data: 1 IC50
Activity Spreadsheet -- Enzyme Inhibition Constant Data from BindingDB
Found 1 hit for monomerid = 22062
Trg + Lig
Ki
nM
ΔG°
kcal/mole
IC50
nM
Kd
nM
EC50/IC50
nM
koff
s-1
kon
M-1s-1
pHTemp
°C
Cathepsin B-Like Cysteine Protease (TbcatB)
(Trypanosoma brucei)
BDBM22062
(9-(cyclohexylmethyl)-6-{[(3-methylphenyl)methyl]am...)
Show SMILES Cc1cccc(CNc2nc(nc3n(CC4CCCCC4)cnc23)C#N)c1
Show InChI InChI=1S/C21H24N6/c1-15-6-5-9-17(10-15)12-23-20-19-21(26-18(11-22)25-20)27(14-24-19)13-16-7-3-2-4-8-16/h5-6,9-10,14,16H,2-4,7-8,12-13H2,1H3,(H,23,25,26)
n/an/a>2.50E+4n/an/an/an/a5.522
University of California at San Francisco
Assay Description
Enzyme activity was assayed in a 96-well plate format. TbcatB was incubated with inhibitor compound at room temperature for 20 min before the additio...
J Med Chem 51: 545-52 (2008)
Article DOI: 10.1021/jm070760l
BindingDB Entry DOI: 10.7270/Q2V40SH0