BDBM22067 9-butyl-6-{[(4-chlorophenyl)methyl]amino}-9H-purine-2-carbonitrile::Compound 3{10,12}
SMILES: CCCCn1cnc2c(NCc3ccc(Cl)cc3)nc(nc12)C#N
InChI Key: InChIKey=JEHKBLKZIKUZHP-UHFFFAOYSA-N
Data: 1 IC50
Activity Spreadsheet -- Enzyme Inhibition Constant Data from BindingDB
Found 1 hit for monomerid = 22067
Trg + Lig
Ki
nM
ΔG°
kcal/mole
IC50
nM
Kd
nM
EC50/IC50
nM
koff
s-1
kon
M-1s-1
pHTemp
°C
Cathepsin B-Like Cysteine Protease (TbcatB)
(Trypanosoma brucei)
BDBM22067
(9-butyl-6-{[(4-chlorophenyl)methyl]amino}-9H-purin...)
Show SMILES CCCCn1cnc2c(NCc3ccc(Cl)cc3)nc(nc12)C#N
Show InChI InChI=1S/C17H17ClN6/c1-2-3-8-24-11-21-15-16(22-14(9-19)23-17(15)24)20-10-12-4-6-13(18)7-5-12/h4-7,11H,2-3,8,10H2,1H3,(H,20,22,23)
n/an/a 1.00E+4n/an/an/an/a5.522
University of California at San Francisco
Assay Description
Enzyme activity was assayed in a 96-well plate format. TbcatB was incubated with inhibitor compound at room temperature for 20 min before the additio...
J Med Chem 51: 545-52 (2008)
Article DOI: 10.1021/jm070760l
BindingDB Entry DOI: 10.7270/Q2V40SH0