BDBM22074 9-butyl-6-{[(4-methoxyphenyl)methyl]amino}-9H-purine-2-carbonitrile::Compound 3{5,12}
SMILES: CCCCn1cnc2c(NCc3ccc(OC)cc3)nc(nc12)C#N
InChI Key: InChIKey=POVXXMYAQGIGCL-UHFFFAOYSA-N
Data: 1 IC50
Activity Spreadsheet -- Enzyme Inhibition Constant Data from BindingDB
Found 1 hit for monomerid = 22074
Trg + Lig
Ki
nM
ΔG°
kcal/mole
IC50
nM
Kd
nM
EC50/IC50
nM
koff
s-1
kon
M-1s-1
pHTemp
°C
Cathepsin B-Like Cysteine Protease (TbcatB)
(Trypanosoma brucei)
BDBM22074
(9-butyl-6-{[(4-methoxyphenyl)methyl]amino}-9H-puri...)
Show SMILES CCCCn1cnc2c(NCc3ccc(OC)cc3)nc(nc12)C#N
Show InChI InChI=1S/C18H20N6O/c1-3-4-9-24-12-21-16-17(22-15(10-19)23-18(16)24)20-11-13-5-7-14(25-2)8-6-13/h5-8,12H,3-4,9,11H2,1-2H3,(H,20,22,23)
n/an/a 6.00E+3n/an/an/an/a5.522
University of California at San Francisco
Assay Description
Enzyme activity was assayed in a 96-well plate format. TbcatB was incubated with inhibitor compound at room temperature for 20 min before the additio...
J Med Chem 51: 545-52 (2008)
Article DOI: 10.1021/jm070760l
BindingDB Entry DOI: 10.7270/Q2V40SH0