null
SMILES: CCC(CC)(COc1ccc(cn1)-c1ccc(nc1)-c1ncc([nH]1)C(F)(F)F)C(O)=O
InChI Key: InChIKey=XZFVKWGKDMBZSN-UHFFFAOYSA-N
Activity Spreadsheet -- Enzyme Inhibition Constant Data from BindingDB
Found 1 hit for monomerid = 220908
Trg + Lig
Ki
nM
ΔG°
kcal/mole
IC50
nM
Kd
nM
EC50/IC50
nM
koff
s-1
kon
M-1s-1
pHTemp
°C
Diacylglycerol O-acyltransferase 1
(Homo sapiens (Human))
BDBM220908
(US9302996, 23)
Show SMILES CCC(CC)(COc1ccc(cn1)-c1ccc(nc1)-c1ncc([nH]1)C(F)(F)F)C(O)=O
Show InChI InChI=1S/C21H21F3N4O3/c1-3-20(4-2,19(29)30)12-31-17-8-6-14(10-26-17)13-5-7-15(25-9-13)18-27-11-16(28-18)21(22,23)24/h5-11H,3-4,12H2,1-2H3,(H,27,28)(H,29,30)
US Patent
n/an/a 0.760n/an/an/an/a7.430
MITSUBISHI TANABE PHARMA CORPORATION
US Patent
Assay Description
As a buffer to be used in the enzymatic reaction of DGAT1, 100 mM Tris-HCl (pH 7.4), 200 mM Sucrose, 20 mM MgCl2, 0.125% Bovine Serum Albumin (BSA) w...
US Patent US9302996 (2016)
BindingDB Entry DOI: 10.7270/Q2TM790N