BDBM220993 US9302996, 108
SMILES: Cc1cc(OCC(C)(C)C(O)=O)ncc1-c1ccc(cc1)-c1ncc(CC2CC2)[nH]1
InChI Key: InChIKey=MXNUFOBACKPRRN-UHFFFAOYSA-N
Data: 1 IC50
Activity Spreadsheet -- Enzyme Inhibition Constant Data from BindingDB
Found 1 hit for monomerid = 220993
Trg + Lig
Ki
nM
ΔG°
kcal/mole
IC50
nM
Kd
nM
EC50/IC50
nM
koff
s-1
kon
M-1s-1
pHTemp
°C
Diacylglycerol O-acyltransferase 1 (DGAT1)
(Homo sapiens (Human))
BDBM220993
(US9302996, 108)
Show SMILES Cc1cc(OCC(C)(C)C(O)=O)ncc1-c1ccc(cc1)-c1ncc(CC2CC2)[nH]1
Show InChI InChI=1S/C24H27N3O3/c1-15-10-21(30-14-24(2,3)23(28)29)25-13-20(15)17-6-8-18(9-7-17)22-26-12-19(27-22)11-16-4-5-16/h6-10,12-13,16H,4-5,11,14H2,1-3H3,(H,26,27)(H,28,29)
US Patent
n/an/a 1.20n/an/an/an/a7.430
MITSUBISHI TANABE PHARMA CORPORATION
US Patent
Assay Description
As a buffer to be used in the enzymatic reaction of DGAT1, 100 mM Tris-HCl (pH 7.4), 200 mM Sucrose, 20 mM MgCl2, 0.125% Bovine Serum Albumin (BSA) w...
US Patent US9302996 (2016)
BindingDB Entry DOI: 10.7270/Q2TM790N