BDBM22106 7-{[(2R,4S)-2,4-bis(hydroxymethyl)azetidin-1-yl]methyl}-3H,4H,5H-pyrrolo[3,2-d]pyrimidin-4-one::Azetidine based compound, 40
SMILES: OC[C@H]1C[C@@H](CO)N1Cc1c[nH]c2c1nc[nH]c2=O
InChI Key: InChIKey=ZZDOJITUEXBERC-DTORHVGOSA-N
Data: 3 KI
Activity Spreadsheet -- Enzyme Inhibition Constant Data from BindingDB
Found 3 hits for monomerid = 22106
Trg + Lig
Ki
nM
ΔG°
kcal/mole
IC50
nM
Kd
nM
EC50/IC50
nM
koff
s-1
kon
M-1s-1
pHTemp
°C
Purine nucleoside phosphorylase
(Homo sapiens (Human))
BDBM22106
(7-{[(2R,4S)-2,4-bis(hydroxymethyl)azetidin-1-yl]me...)
Show SMILES OC[C@H]1C[C@@H](CO)N1Cc1c[nH]c2c1nc[nH]c2=O |r|
Show InChI InChI=1S/C12H16N4O3/c17-4-8-1-9(5-18)16(8)3-7-2-13-11-10(7)14-6-15-12(11)19/h2,6,8-9,13,17-18H,1,3-5H2,(H,14,15,19)/t8-,9+
Reactome pathway
12.9 -10.6n/an/an/an/an/a7.722
Industrial Research Limited
Assay Description
PNP activity was monitored by absorbance change in a coupled assay. In the assay, inosine was converted to hypoxanthine, and then hypoxanthine was co...
J Med Chem 51: 948-56 (2008)
Article DOI: 10.1021/jm701265n
BindingDB Entry DOI: 10.7270/Q2QC01T3
Purine Nucleoside Phosphorylase (PNP)
(Bos taurus (bovine))
BDBM22106
(7-{[(2R,4S)-2,4-bis(hydroxymethyl)azetidin-1-yl]me...)
Show SMILES OC[C@H]1C[C@@H](CO)N1Cc1c[nH]c2c1nc[nH]c2=O |r|
Show InChI InChI=1S/C12H16N4O3/c17-4-8-1-9(5-18)16(8)3-7-2-13-11-10(7)14-6-15-12(11)19/h2,6,8-9,13,17-18H,1,3-5H2,(H,14,15,19)/t8-,9+
Reactome pathway
16 -10.5n/an/an/an/an/a7.722
Industrial Research Limited
Assay Description
PNP activity was monitored by absorbance change in a coupled assay. In the assay, inosine was converted to hypoxanthine, and then hypoxanthine was co...
J Med Chem 51: 948-56 (2008)
Article DOI: 10.1021/jm701265n
BindingDB Entry DOI: 10.7270/Q2QC01T3
Purine Nucleoside Phosphorylase (PNP)
(Plasmodium falciparum)
BDBM22106
(7-{[(2R,4S)-2,4-bis(hydroxymethyl)azetidin-1-yl]me...)
Show SMILES OC[C@H]1C[C@@H](CO)N1Cc1c[nH]c2c1nc[nH]c2=O |r|
Show InChI InChI=1S/C12H16N4O3/c17-4-8-1-9(5-18)16(8)3-7-2-13-11-10(7)14-6-15-12(11)19/h2,6,8-9,13,17-18H,1,3-5H2,(H,14,15,19)/t8-,9+
1.29E+3 -7.95n/an/an/an/an/a7.722
Industrial Research Limited
Assay Description
PNP activity was monitored by absorbance change in a coupled assay. In the assay, inosine was converted to hypoxanthine, and then hypoxanthine was co...
J Med Chem 51: 948-56 (2008)
Article DOI: 10.1021/jm701265n
BindingDB Entry DOI: 10.7270/Q2QC01T3