BDBM221130 US9303012, 56
SMILES: CN1[C@H](N(CC1=O)C(=O)c1ccc(N2CC(F)(F)C2)c(OCC2CC2)n1)C(C)(C)C
InChI Key: InChIKey=VVWIOYCPQRCGBQ-LJQANCHMSA-N
Data: 2 EC50
Activity Spreadsheet -- Enzyme Inhibition Constant Data from BindingDB
Found 2 hits for monomerid = 221130
Trg + Lig
Ki
nM
ΔG°
kcal/mole
IC50
nM
Kd
nM
EC50/IC50
nM
koff
s-1
kon
M-1s-1
pHTemp
°C
Cannabinoid receptor 1
(Homo sapiens (Human))
BDBM221130
(US9303012, 56)
Show SMILES CN1[C@H](N(CC1=O)C(=O)c1ccc(N2CC(F)(F)C2)c(OCC2CC2)n1)C(C)(C)C |r|
Show InChI InChI=1S/C21H28F2N4O3/c1-20(2,3)19-25(4)16(28)9-27(19)18(29)14-7-8-15(26-11-21(22,23)12-26)17(24-14)30-10-13-5-6-13/h7-8,13,19H,5-6,9-12H2,1-4H3/t19-/m1/s1
NCI pathway
Reactome pathway
US Patent
n/an/an/an/a>1.00E+4n/an/an/a37
HOFFMAN-LA ROCHE INC.
US Patent
Assay Description
CHO cells expressing human CB1 or CB2 receptors are seeded 17-24 hours prior to the experiment 50.000 cells per well in a black 96 well plate with fl...
US Patent US9303012 (2016)
BindingDB Entry DOI: 10.7270/Q2FF3R7H
Cannabinoid receptor 2
(Homo sapiens (Human))
BDBM221130
(US9303012, 56)
Show SMILES CN1[C@H](N(CC1=O)C(=O)c1ccc(N2CC(F)(F)C2)c(OCC2CC2)n1)C(C)(C)C |r|
Show InChI InChI=1S/C21H28F2N4O3/c1-20(2,3)19-25(4)16(28)9-27(19)18(29)14-7-8-15(26-11-21(22,23)12-26)17(24-14)30-10-13-5-6-13/h7-8,13,19H,5-6,9-12H2,1-4H3/t19-/m1/s1
Reactome pathway
US Patent
n/an/an/an/a 36.9n/an/an/a37
HOFFMAN-LA ROCHE INC.
US Patent
Assay Description
CHO cells expressing human CB1 or CB2 receptors are seeded 17-24 hours prior to the experiment 50.000 cells per well in a black 96 well plate with fl...
US Patent US9303012 (2016)
BindingDB Entry DOI: 10.7270/Q2FF3R7H