null
SMILES: FC1(F)CN(C1)c1ccc(nc1OCC1CC1)C(=O)N1C[C@@H]2C[C@H]1CO2
InChI Key: InChIKey=HRBJPGNHRKGVGM-STQMWFEESA-N
Activity Spreadsheet -- Enzyme Inhibition Constant Data from BindingDB
Found 2 hits for monomerid = 221139
Trg + Lig
Ki
nM
ΔG°
kcal/mole
IC50
nM
Kd
nM
EC50/IC50
nM
koff
s-1
kon
M-1s-1
pHTemp
°C
Cannabinoid receptor 1
(Homo sapiens (Human))
BDBM221139
(US9303012, 65)
Show SMILES FC1(F)CN(C1)c1ccc(nc1OCC1CC1)C(=O)N1C[C@@H]2C[C@H]1CO2 |r,TLB:17:19:25.24:22|
Show InChI InChI=1S/C18H21F2N3O3/c19-18(20)9-22(10-18)15-4-3-14(21-16(15)26-7-11-1-2-11)17(24)23-6-13-5-12(23)8-25-13/h3-4,11-13H,1-2,5-10H2/t12-,13-/m0/s1
NCI pathway
Reactome pathway
US Patent
n/an/an/an/a>1.00E+4n/an/an/a37
HOFFMAN-LA ROCHE INC.
US Patent
Assay Description
CHO cells expressing human CB1 or CB2 receptors are seeded 17-24 hours prior to the experiment 50.000 cells per well in a black 96 well plate with fl...
US Patent US9303012 (2016)
BindingDB Entry DOI: 10.7270/Q2FF3R7H
Cannabinoid receptor 2
(Homo sapiens (Human))
BDBM221139
(US9303012, 65)
Show SMILES FC1(F)CN(C1)c1ccc(nc1OCC1CC1)C(=O)N1C[C@@H]2C[C@H]1CO2 |r,TLB:17:19:25.24:22|
Show InChI InChI=1S/C18H21F2N3O3/c19-18(20)9-22(10-18)15-4-3-14(21-16(15)26-7-11-1-2-11)17(24)23-6-13-5-12(23)8-25-13/h3-4,11-13H,1-2,5-10H2/t12-,13-/m0/s1
Reactome pathway
US Patent
n/an/an/an/a 100n/an/an/a37
HOFFMAN-LA ROCHE INC.
US Patent
Assay Description
CHO cells expressing human CB1 or CB2 receptors are seeded 17-24 hours prior to the experiment 50.000 cells per well in a black 96 well plate with fl...
US Patent US9303012 (2016)
BindingDB Entry DOI: 10.7270/Q2FF3R7H