BDBM221143 US9303012, 69
SMILES: NC(=O)[C@@H]1C[C@H](F)CN1C(=O)c1ccc(C2CC2)c(OCC2CC2)n1
InChI Key: InChIKey=AGFOWDLWXFQXDY-WFASDCNBSA-N
Data: 2 EC50
Activity Spreadsheet -- Enzyme Inhibition Constant Data from BindingDB
Found 2 hits for monomerid = 221143
Trg + Lig
Ki
nM
ΔG°
kcal/mole
IC50
nM
Kd
nM
EC50/IC50
nM
koff
s-1
kon
M-1s-1
pHTemp
°C
Cannabinoid receptor 1
(Homo sapiens (Human))
BDBM221143
(US9303012, 69)
Show SMILES NC(=O)[C@@H]1C[C@H](F)CN1C(=O)c1ccc(C2CC2)c(OCC2CC2)n1 |r|
Show InChI InChI=1S/C18H22FN3O3/c19-12-7-15(16(20)23)22(8-12)18(24)14-6-5-13(11-3-4-11)17(21-14)25-9-10-1-2-10/h5-6,10-12,15H,1-4,7-9H2,(H2,20,23)/t12-,15-/m0/s1
NCI pathway
Reactome pathway
US Patent
n/an/an/an/a>1.00E+4n/an/an/a37
HOFFMAN-LA ROCHE INC.
US Patent
Assay Description
CHO cells expressing human CB1 or CB2 receptors are seeded 17-24 hours prior to the experiment 50.000 cells per well in a black 96 well plate with fl...
US Patent US9303012 (2016)
BindingDB Entry DOI: 10.7270/Q2FF3R7H
Cannabinoid receptor 2
(Homo sapiens (Human))
BDBM221143
(US9303012, 69)
Show SMILES NC(=O)[C@@H]1C[C@H](F)CN1C(=O)c1ccc(C2CC2)c(OCC2CC2)n1 |r|
Show InChI InChI=1S/C18H22FN3O3/c19-12-7-15(16(20)23)22(8-12)18(24)14-6-5-13(11-3-4-11)17(21-14)25-9-10-1-2-10/h5-6,10-12,15H,1-4,7-9H2,(H2,20,23)/t12-,15-/m0/s1
Reactome pathway
US Patent
n/an/an/an/a 1.04E+3n/an/an/a37
HOFFMAN-LA ROCHE INC.
US Patent
Assay Description
CHO cells expressing human CB1 or CB2 receptors are seeded 17-24 hours prior to the experiment 50.000 cells per well in a black 96 well plate with fl...
US Patent US9303012 (2016)
BindingDB Entry DOI: 10.7270/Q2FF3R7H