BDBM221154 US9303012, 80
SMILES: NC(=O)[C@@H]1C[C@H](F)CN1C(=O)c1ccc(N2CC(F)(F)C2)c(OCC2CC2)n1
InChI Key: InChIKey=DIUXLOSTTAWMLL-FZMZJTMJSA-N
Data: 2 EC50
Activity Spreadsheet -- Enzyme Inhibition Constant Data from BindingDB
Found 2 hits for monomerid = 221154
Trg + Lig
Ki
nM
ΔG°
kcal/mole
IC50
nM
Kd
nM
EC50/IC50
nM
koff
s-1
kon
M-1s-1
pHTemp
°C
Cannabinoid receptor 1
(Homo sapiens (Human))
BDBM221154
(US9303012, 80)
Show SMILES NC(=O)[C@@H]1C[C@H](F)CN1C(=O)c1ccc(N2CC(F)(F)C2)c(OCC2CC2)n1 |r|
Show InChI InChI=1S/C18H21F3N4O3/c19-11-5-14(15(22)26)25(6-11)17(27)12-3-4-13(24-8-18(20,21)9-24)16(23-12)28-7-10-1-2-10/h3-4,10-11,14H,1-2,5-9H2,(H2,22,26)/t11-,14-/m0/s1
NCI pathway
Reactome pathway
US Patent
n/an/an/an/a>1.00E+4n/an/an/a37
HOFFMAN-LA ROCHE INC.
US Patent
Assay Description
CHO cells expressing human CB1 or CB2 receptors are seeded 17-24 hours prior to the experiment 50.000 cells per well in a black 96 well plate with fl...
US Patent US9303012 (2016)
BindingDB Entry DOI: 10.7270/Q2FF3R7H
Cannabinoid receptor 2
(Homo sapiens (Human))
BDBM221154
(US9303012, 80)
Show SMILES NC(=O)[C@@H]1C[C@H](F)CN1C(=O)c1ccc(N2CC(F)(F)C2)c(OCC2CC2)n1 |r|
Show InChI InChI=1S/C18H21F3N4O3/c19-11-5-14(15(22)26)25(6-11)17(27)12-3-4-13(24-8-18(20,21)9-24)16(23-12)28-7-10-1-2-10/h3-4,10-11,14H,1-2,5-9H2,(H2,22,26)/t11-,14-/m0/s1
Reactome pathway
US Patent
n/an/an/an/a 342n/an/an/a37
HOFFMAN-LA ROCHE INC.
US Patent
Assay Description
CHO cells expressing human CB1 or CB2 receptors are seeded 17-24 hours prior to the experiment 50.000 cells per well in a black 96 well plate with fl...
US Patent US9303012 (2016)
BindingDB Entry DOI: 10.7270/Q2FF3R7H