BDBM22116 aza-peptide Michael acceptor, 7b::benzyl (2E)-3-{N'-[(2S)-2-[(2S)-2-{[(benzyloxy)carbonyl]amino}propanamido]propanoyl]-N-(carbamoylmethyl)hydrazinecarbonyl}prop-2-enoate
SMILES: C[C@H](NC(=O)OCc1ccccc1)C(=O)N[C@@H](C)C(=O)NN(CC(N)=O)C(=O)C=CC(=O)OCc1ccccc1
InChI Key: InChIKey=LAOGMMDQFBFYCI-OALUTQOASA-N
Data: 3 IC50
Activity Spreadsheet -- Enzyme Inhibition Constant Data from BindingDB
Found 3 hits for monomerid = 22116
Trg + Lig
Ki
nM
ΔG°
kcal/mole
IC50
nM
Kd
nM
EC50/IC50
nM
koff
s-1
kon
M-1s-1
pHTemp
°C
Asparaginyl Endopeptidase (AE)
(Schistosoma mansoni)
BDBM22116
(aza-peptide Michael acceptor, 7b | benzyl (2E)-3-{...)
Show SMILES C[C@H](NC(=O)OCc1ccccc1)C(=O)N[C@@H](C)C(=O)NN(CC(N)=O)C(=O)C=CC(=O)OCc1ccccc1 |r,w:28.28|
Show InChI InChI=1S/C27H31N5O8/c1-18(30-27(38)40-17-21-11-7-4-8-12-21)25(36)29-19(2)26(37)31-32(15-22(28)33)23(34)13-14-24(35)39-16-20-9-5-3-6-10-20/h3-14,18-19H,15-17H2,1-2H3,(H2,28,33)(H,29,36)(H,30,38)(H,31,37)/t18-,19-/m0/s1
n/an/a 38n/an/an/an/a6.822
Georgia Institute of Technology
Assay Description
AE activity in the induction medium was measured with the substrate Cbz-Ala-Ala-Asn-AMC. In a black 96-well microtiter plate, aza-peptidyl inhibitors...
J Med Chem 51: 2816-32 (2008)
Article DOI: 10.1021/jm701311r
BindingDB Entry DOI: 10.7270/Q2KK9937
Asparaginyl Endopeptidase (AE)
(Ixodes ricinus)
BDBM22116
(aza-peptide Michael acceptor, 7b | benzyl (2E)-3-{...)
Show SMILES C[C@H](NC(=O)OCc1ccccc1)C(=O)N[C@@H](C)C(=O)NN(CC(N)=O)C(=O)C=CC(=O)OCc1ccccc1 |r,w:28.28|
Show InChI InChI=1S/C27H31N5O8/c1-18(30-27(38)40-17-21-11-7-4-8-12-21)25(36)29-19(2)26(37)31-32(15-22(28)33)23(34)13-14-24(35)39-16-20-9-5-3-6-10-20/h3-14,18-19H,15-17H2,1-2H3,(H2,28,33)(H,29,36)(H,30,38)(H,31,37)/t18-,19-/m0/s1
n/an/a<1n/an/an/an/an/a25
Georgia Institute of Technology
Assay Description
AE activity in the induction medium was measured with the substrate Cbz-Ala-Ala-Asn-AMC. In a black 96-well microtiter plate, aza-peptidyl inhibitors...
J Med Chem 51: 2816-32 (2008)
Article DOI: 10.1021/jm701311r
BindingDB Entry DOI: 10.7270/Q2KK9937
Asparaginyl Endopeptidase (AE)
(Trichomonas vaginalis G3)
BDBM22116
(aza-peptide Michael acceptor, 7b | benzyl (2E)-3-{...)
Show SMILES C[C@H](NC(=O)OCc1ccccc1)C(=O)N[C@@H](C)C(=O)NN(CC(N)=O)C(=O)C=CC(=O)OCc1ccccc1 |r,w:28.28|
Show InChI InChI=1S/C27H31N5O8/c1-18(30-27(38)40-17-21-11-7-4-8-12-21)25(36)29-19(2)26(37)31-32(15-22(28)33)23(34)13-14-24(35)39-16-20-9-5-3-6-10-20/h3-14,18-19H,15-17H2,1-2H3,(H2,28,33)(H,29,36)(H,30,38)(H,31,37)/t18-,19-/m0/s1
n/an/a 5n/an/an/an/a6.822
Georgia Institute of Technology
Assay Description
AE activity in the induction medium was measured with the substrate Cbz-Ala-Ala-Asn-AMC. In a black 96-well microtiter plate, aza-peptidyl inhibitors...
J Med Chem 51: 2816-32 (2008)
Article DOI: 10.1021/jm701311r
BindingDB Entry DOI: 10.7270/Q2KK9937