null
SMILES: Cn1cncc1C(O)(c1ccc(nc1)C(F)(F)F)c1ccc2nc(N3CCCC3)c(Oc3ccc(cc3)C#N)c(Cl)c2c1
InChI Key: InChIKey=XTJBVBCWFGLULK-UHFFFAOYSA-N
Activity Spreadsheet -- Enzyme Inhibition Constant Data from BindingDB
Found 2 hits for monomerid = 221259
Trg + Lig
Ki
nM
ΔG°
kcal/mole
IC50
nM
Kd
nM
EC50/IC50
nM
koff
s-1
kon
M-1s-1
pHTemp
°C
Nuclear receptor ROR-gamma [258-518,Y502F]
(Homo sapiens (Human))
BDBM221259
(US9303015, 33)
Show SMILES Cn1cncc1C(O)(c1ccc(nc1)C(F)(F)F)c1ccc2nc(N3CCCC3)c(Oc3ccc(cc3)C#N)c(Cl)c2c1
Show InChI InChI=1S/C31H24ClF3N6O2/c1-40-18-37-17-26(40)30(42,21-7-11-25(38-16-21)31(33,34)35)20-6-10-24-23(14-20)27(32)28(29(39-24)41-12-2-3-13-41)43-22-8-4-19(15-36)5-9-22/h4-11,14,16-18,42H,2-3,12-13H2,1H3
US Patent
n/an/a 280n/an/an/an/an/an/a
JANSSEN PHARMACEUTICA NV
US Patent
Assay Description
The reporter assay was performed by transiently transfecting HEK293T cells with 5 μg of pBIND-RORγt LBD or pBIND-RORγt LBD-AF2 and 5 &...
US Patent US9303015 (2016)
BindingDB Entry DOI: 10.7270/Q29P30H5
Nuclear receptor ROR-gamma [258-518]
(Homo sapiens (Human))
BDBM221259
(US9303015, 33)
Show SMILES Cn1cncc1C(O)(c1ccc(nc1)C(F)(F)F)c1ccc2nc(N3CCCC3)c(Oc3ccc(cc3)C#N)c(Cl)c2c1
Show InChI InChI=1S/C31H24ClF3N6O2/c1-40-18-37-17-26(40)30(42,21-7-11-25(38-16-21)31(33,34)35)20-6-10-24-23(14-20)27(32)28(29(39-24)41-12-2-3-13-41)43-22-8-4-19(15-36)5-9-22/h4-11,14,16-18,42H,2-3,12-13H2,1H3
US Patent
n/an/an/a 66n/an/an/a7.01
JANSSEN PHARMACEUTICA NV
US Patent
Assay Description
ThermoFluor® experiments were carried out using instruments owned by Janssen Research and Discovery, L.L.C. through its acquisition of 3-Dimensio...
US Patent US9303015 (2016)
BindingDB Entry DOI: 10.7270/Q29P30H5