BDBM22156 (3R,5S,6E)-7-[4-(4-fluorophenyl)-2-[N-(1-methyl-1H-pyrazol-3-yl)methanesulfonamido]-6-(propan-2-yl)pyrimidin-5-yl]-3,5-dihydroxyhept-6-enoic acid::pyrazole compound, 12c
SMILES: CC(C)c1nc(nc(-c2ccc(F)cc2)c1\C=C\[C@@H](O)C[C@@H](O)CC(O)=O)N(c1ccn(C)n1)S(C)(=O)=O
InChI Key: InChIKey=CQQSHHILLHFILU-BGGMYYEUSA-N
Data: 1 IC50  1 EC50
Activity Spreadsheet -- Enzyme Inhibition Constant Data from BindingDB
Found 1 hit for monomerid = 22156
Trg + Lig
Ki
nM
ΔG°
kcal/mole
IC50
nM
Kd
nM
EC50/IC50
nM
koff
s-1
kon
M-1s-1
pHTemp
°C
HMG-CoA reductase
(Rattus norvegicus (rat))
BDBM22156
((3R,5S,6E)-7-[4-(4-fluorophenyl)-2-[N-(1-methyl-1H...)
Show SMILES CC(C)c1nc(nc(-c2ccc(F)cc2)c1\C=C\[C@@H](O)C[C@@H](O)CC(O)=O)N(c1ccn(C)n1)S(C)(=O)=O |r|
Show InChI InChI=1S/C25H30FN5O6S/c1-15(2)23-20(10-9-18(32)13-19(33)14-22(34)35)24(16-5-7-17(26)8-6-16)28-25(27-23)31(38(4,36)37)21-11-12-30(3)29-21/h5-12,15,18-19,32-33H,13-14H2,1-4H3,(H,34,35)/b10-9+/t18-,19-/m1/s1
Reactome pathway
n/an/a 3.70n/a 7.70n/an/a7.037
Bristol-Myers Squibb Company
Assay Description
Enzyme Assay for HMG-CoA reductase was based on the conversion of isotopically labeled HMG-CoA to mevalonic acid using rat liver microsomes as enzyme...
J Med Chem 51: 2722-33 (2008)
Article DOI: 10.1021/jm800001n
BindingDB Entry DOI: 10.7270/Q2FT8JB2