BDBM2217 2-Pyridinone derivative 12::3-[2-(1-benzofuran-2-yl)ethyl]-5-ethyl-6-methyl-1,2-dihydropyridin-2-one::CHEMBL98159::Pyridinone deriv. 9
SMILES: CCc1cc(CCc2cc3ccccc3o2)c(=O)[nH]c1C
InChI Key: InChIKey=SJASAUDWUFJISL-UHFFFAOYSA-N
Data: 3 IC50
Activity Spreadsheet -- Enzyme Inhibition Constant Data from BindingDB
Found 3 hits for monomerid = 2217
Trg + Lig
Ki
nM
ΔG°
kcal/mole
IC50
nM
Kd
nM
EC50/IC50
nM
koff
s-1
kon
M-1s-1
pHTemp
°C
HIV-1 Reverse Transcriptase
(Human immunodeficiency virus type 1)
BDBM2217
(2-Pyridinone derivative 12 | 3-[2-(1-benzofuran-2-...)
Show SMILES CCc1cc(CCc2cc3ccccc3o2)c(=O)[nH]c1C
Show InChI InChI=1S/C18H19NO2/c1-3-13-10-15(18(20)19-12(13)2)8-9-16-11-14-6-4-5-7-17(14)21-16/h4-7,10-11H,3,8-9H2,1-2H3,(H,19,20)
n/an/a 77n/an/an/an/a8.2n/a
Merck Sharp and Dohme Research Laboratories
Assay Description
The IC50 of reverse transcriptase is the concentration that inhibits 50% of recombinant HIV-1 RT RNA-directed DNA polymerase activity in vitro.
J Med Chem 34: 2922-5 (1991)
Article DOI: 10.1021/jm00113a036
BindingDB Entry DOI: 10.7270/Q2WM1BK1
Human immunodeficiency virus type 1 reverse transcriptase
(Human immunodeficiency virus 1)
BDBM2217
(2-Pyridinone derivative 12 | 3-[2-(1-benzofuran-2-...)
Show SMILES CCc1cc(CCc2cc3ccccc3o2)c(=O)[nH]c1C
Show InChI InChI=1S/C18H19NO2/c1-3-13-10-15(18(20)19-12(13)2)8-9-16-11-14-6-4-5-7-17(14)21-16/h4-7,10-11H,3,8-9H2,1-2H3,(H,19,20)
n/an/a 130n/an/an/an/an/an/a
Merck Reserch Laboratories
Curated by ChEMBL
Assay Description
Tested for inhibition against HIV-1 RT (used (poly)rC-(oligo)dG as the template)
J Med Chem 36: 953-66 (1993)
BindingDB Entry DOI: 10.7270/Q2JW8G28
HIV-1 Reverse Transcriptase
(Human immunodeficiency virus type 1)
BDBM2217
(2-Pyridinone derivative 12 | 3-[2-(1-benzofuran-2-...)
Show SMILES CCc1cc(CCc2cc3ccccc3o2)c(=O)[nH]c1C
Show InChI InChI=1S/C18H19NO2/c1-3-13-10-15(18(20)19-12(13)2)8-9-16-11-14-6-4-5-7-17(14)21-16/h4-7,10-11H,3,8-9H2,1-2H3,(H,19,20)
n/an/a 130n/an/an/an/an/an/a
Merck Reserch Laboratories
Curated by ChEMBL
Assay Description
The IC50 of reverse transcriptase is the concentration that inhibits 50% of recombinant HIV-1 RT RNA-directed DNA polymerase activity in vitro.
J Med Chem 36: 953-66 (1993)
BindingDB Entry DOI: 10.7270/Q2JW8G28