BDBM22210 1,2,4-oxadiazole based compound, 27::1-[(4-{5-[4-(2,2-dimethylpropyl)phenyl]-1,2,4-oxadiazol-3-yl}phenyl)methyl]azetidine-3-carboxylic acid
SMILES: CC(C)(C)Cc1ccc(cc1)-c1nc(no1)-c1ccc(CN2CC(C2)C(O)=O)cc1
InChI Key: InChIKey=LGOMWSIGEIXWPD-UHFFFAOYSA-N
Data: 4 IC50
Activity Spreadsheet -- Enzyme Inhibition Constant Data from BindingDB
Found 4 hits for monomerid = 22210
Trg + Lig
Ki
nM
ΔG°
kcal/mole
IC50
nM
Kd
nM
EC50/IC50
nM
koff
s-1
kon
M-1s-1
pHTemp
°C
Sphingosine 1-phosphate receptor 1
(Homo sapiens (Human))
BDBM22210
(1,2,4-oxadiazole based compound, 27 | 1-[(4-{5-[4-...)
Show SMILES CC(C)(C)Cc1ccc(cc1)-c1nc(no1)-c1ccc(CN2CC(C2)C(O)=O)cc1
Show InChI InChI=1S/C24H27N3O3/c1-24(2,3)12-16-4-10-19(11-5-16)22-25-21(26-30-22)18-8-6-17(7-9-18)13-27-14-20(15-27)23(28)29/h4-11,20H,12-15H2,1-3H3,(H,28,29)
Reactome pathway
n/an/a 3.80n/an/an/an/a7.522
Merck Research Laboratories
Assay Description
The assay measures the displacement of [33P]-labeled sphingosine-1-phosphate (S1P) by test compounds from human S1P receptors expressed on CHO cell m...
J Med Chem 48: 6169-73 (2005)
Article DOI: 10.1021/jm0503244
BindingDB Entry DOI: 10.7270/Q26971W9
Sphingosine 1-phosphate receptor 5
(Homo sapiens (Human))
BDBM22210
(1,2,4-oxadiazole based compound, 27 | 1-[(4-{5-[4-...)
Show SMILES CC(C)(C)Cc1ccc(cc1)-c1nc(no1)-c1ccc(CN2CC(C2)C(O)=O)cc1
Show InChI InChI=1S/C24H27N3O3/c1-24(2,3)12-16-4-10-19(11-5-16)22-25-21(26-30-22)18-8-6-17(7-9-18)13-27-14-20(15-27)23(28)29/h4-11,20H,12-15H2,1-3H3,(H,28,29)
NCI pathway
Reactome pathway
n/an/a 6.60n/an/an/an/an/a25
Merck Research Laboratories
Assay Description
The assay measures the displacement of [33P]-labeled sphingosine-1-phosphate (S1P) by test compounds from human S1P receptors expressed on CHO cell m...
J Med Chem 48: 6169-73 (2005)
Article DOI: 10.1021/jm0503244
BindingDB Entry DOI: 10.7270/Q26971W9
Sphingosine 1-phosphate receptor 4
(Homo sapiens (Human))
BDBM22210
(1,2,4-oxadiazole based compound, 27 | 1-[(4-{5-[4-...)
Show SMILES CC(C)(C)Cc1ccc(cc1)-c1nc(no1)-c1ccc(CN2CC(C2)C(O)=O)cc1
Show InChI InChI=1S/C24H27N3O3/c1-24(2,3)12-16-4-10-19(11-5-16)22-25-21(26-30-22)18-8-6-17(7-9-18)13-27-14-20(15-27)23(28)29/h4-11,20H,12-15H2,1-3H3,(H,28,29)
NCI pathway
Reactome pathway
n/an/a 90n/an/an/an/an/a25
Merck Research Laboratories
Assay Description
The assay measures the displacement of [33P]-labeled sphingosine-1-phosphate (S1P) by test compounds from human S1P receptors expressed on CHO cell m...
J Med Chem 48: 6169-73 (2005)
Article DOI: 10.1021/jm0503244
BindingDB Entry DOI: 10.7270/Q26971W9
Sphingosine 1-phosphate receptor 3
(Homo sapiens (Human))
BDBM22210
(1,2,4-oxadiazole based compound, 27 | 1-[(4-{5-[4-...)
Show SMILES CC(C)(C)Cc1ccc(cc1)-c1nc(no1)-c1ccc(CN2CC(C2)C(O)=O)cc1
Show InChI InChI=1S/C24H27N3O3/c1-24(2,3)12-16-4-10-19(11-5-16)22-25-21(26-30-22)18-8-6-17(7-9-18)13-27-14-20(15-27)23(28)29/h4-11,20H,12-15H2,1-3H3,(H,28,29)
NCI pathway
Reactome pathway
n/an/a 1.00E+4n/an/an/an/a7.522
Merck Research Laboratories
Assay Description
The assay measures the displacement of [33P]-labeled sphingosine-1-phosphate (S1P) by test compounds from human S1P receptors expressed on CHO cell m...
J Med Chem 48: 6169-73 (2005)
Article DOI: 10.1021/jm0503244
BindingDB Entry DOI: 10.7270/Q26971W9