BDBM22211 1,2,4-oxadiazole based compound, 28::1-({4-[5-(4-ethoxyphenyl)-1,2,4-oxadiazol-3-yl]phenyl}methyl)azetidine-3-carboxylic acid::US10676467, Compound TZ 35 100
SMILES: CCOc1ccc(cc1)-c1nc(no1)-c1ccc(CN2CC(C2)C(O)=O)cc1
InChI Key: InChIKey=IOIGVVYTXMGUFG-UHFFFAOYSA-N
Data: 7 IC50
Activity Spreadsheet -- Enzyme Inhibition Constant Data from BindingDB
Found 7 hits for monomerid = 22211
Trg + Lig
Ki
nM
ΔG°
kcal/mole
IC50
nM
Kd
nM
EC50/IC50
nM
koff
s-1
kon
M-1s-1
pHTemp
°C
Sphingosine 1-phosphate receptor 1
(Homo sapiens (Human))
BDBM22211
(1,2,4-oxadiazole based compound, 28 | 1-({4-[5-(4-...)
Show SMILES CCOc1ccc(cc1)-c1nc(no1)-c1ccc(CN2CC(C2)C(O)=O)cc1
Show InChI InChI=1S/C21H21N3O4/c1-2-27-18-9-7-16(8-10-18)20-22-19(23-28-20)15-5-3-14(4-6-15)11-24-12-17(13-24)21(25)26/h3-10,17H,2,11-13H2,1H3,(H,25,26)
Reactome pathway
n/an/a 5.10n/an/an/an/a7.522
Merck Research Laboratories
Assay Description
The assay measures the displacement of [33P]-labeled sphingosine-1-phosphate (S1P) by test compounds from human S1P receptors expressed on CHO cell m...
J Med Chem 48: 6169-73 (2005)
Article DOI: 10.1021/jm0503244
BindingDB Entry DOI: 10.7270/Q26971W9
Sphingosine 1-phosphate receptor 3
(Homo sapiens (Human))
BDBM22211
(1,2,4-oxadiazole based compound, 28 | 1-({4-[5-(4-...)
Show SMILES CCOc1ccc(cc1)-c1nc(no1)-c1ccc(CN2CC(C2)C(O)=O)cc1
Show InChI InChI=1S/C21H21N3O4/c1-2-27-18-9-7-16(8-10-18)20-22-19(23-28-20)15-5-3-14(4-6-15)11-24-12-17(13-24)21(25)26/h3-10,17H,2,11-13H2,1H3,(H,25,26)
NCI pathway
Reactome pathway
n/an/a>1.00E+3n/an/an/an/a7.522
Merck Research Laboratories
Assay Description
The assay measures the displacement of [33P]-labeled sphingosine-1-phosphate (S1P) by test compounds from human S1P receptors expressed on CHO cell m...
J Med Chem 48: 6169-73 (2005)
Article DOI: 10.1021/jm0503244
BindingDB Entry DOI: 10.7270/Q26971W9
Sphingosine 1-phosphate receptor 4
(Homo sapiens (Human))
BDBM22211
(1,2,4-oxadiazole based compound, 28 | 1-({4-[5-(4-...)
Show SMILES CCOc1ccc(cc1)-c1nc(no1)-c1ccc(CN2CC(C2)C(O)=O)cc1
Show InChI InChI=1S/C21H21N3O4/c1-2-27-18-9-7-16(8-10-18)20-22-19(23-28-20)15-5-3-14(4-6-15)11-24-12-17(13-24)21(25)26/h3-10,17H,2,11-13H2,1H3,(H,25,26)
NCI pathway
Reactome pathway
n/an/a>1.00E+3n/an/an/an/an/a25
Merck Research Laboratories
Assay Description
The assay measures the displacement of [33P]-labeled sphingosine-1-phosphate (S1P) by test compounds from human S1P receptors expressed on CHO cell m...
J Med Chem 48: 6169-73 (2005)
Article DOI: 10.1021/jm0503244
BindingDB Entry DOI: 10.7270/Q26971W9
Sphingosine 1-phosphate receptor 3
(Homo sapiens (Human))
BDBM22211
(1,2,4-oxadiazole based compound, 28 | 1-({4-[5-(4-...)
Show SMILES CCOc1ccc(cc1)-c1nc(no1)-c1ccc(CN2CC(C2)C(O)=O)cc1
Show InChI InChI=1S/C21H21N3O4/c1-2-27-18-9-7-16(8-10-18)20-22-19(23-28-20)15-5-3-14(4-6-15)11-24-12-17(13-24)21(25)26/h3-10,17H,2,11-13H2,1H3,(H,25,26)
NCI pathway
Reactome pathway
US Patent
n/an/a>1.00E+3n/an/an/an/an/an/a
Washington University
US Patent
Assay Description
Newly synthesized compounds were first evaluated for binding potency toward S1P1 by a [32P]S1P competitive binding assay following published procedur...
US Patent US10676467 (2020)
Sphingosine 1-phosphate receptor 1
(Homo sapiens (Human))
BDBM22211
(1,2,4-oxadiazole based compound, 28 | 1-({4-[5-(4-...)
Show SMILES CCOc1ccc(cc1)-c1nc(no1)-c1ccc(CN2CC(C2)C(O)=O)cc1
Show InChI InChI=1S/C21H21N3O4/c1-2-27-18-9-7-16(8-10-18)20-22-19(23-28-20)15-5-3-14(4-6-15)11-24-12-17(13-24)21(25)26/h3-10,17H,2,11-13H2,1H3,(H,25,26)
Reactome pathway
US Patent
n/an/a 8.53n/an/an/an/an/an/a
Washington University
US Patent
Assay Description
Newly synthesized compounds were first evaluated for binding potency toward S1P1 by a [32P]S1P competitive binding assay following published procedur...
US Patent US10676467 (2020)
Sphingosine 1-phosphate receptor 2
(Homo sapiens (Human))
BDBM22211
(1,2,4-oxadiazole based compound, 28 | 1-({4-[5-(4-...)
Show SMILES CCOc1ccc(cc1)-c1nc(no1)-c1ccc(CN2CC(C2)C(O)=O)cc1
Show InChI InChI=1S/C21H21N3O4/c1-2-27-18-9-7-16(8-10-18)20-22-19(23-28-20)15-5-3-14(4-6-15)11-24-12-17(13-24)21(25)26/h3-10,17H,2,11-13H2,1H3,(H,25,26)
NCI pathway
Reactome pathway
US Patent
n/an/a>1.00E+3n/an/an/an/an/an/a
Washington University
US Patent
Assay Description
Newly synthesized compounds were first evaluated for binding potency toward S1P1 by a [32P]S1P competitive binding assay following published procedur...
US Patent US10676467 (2020)
Sphingosine 1-phosphate receptor 5
(Homo sapiens (Human))
BDBM22211
(1,2,4-oxadiazole based compound, 28 | 1-({4-[5-(4-...)
Show SMILES CCOc1ccc(cc1)-c1nc(no1)-c1ccc(CN2CC(C2)C(O)=O)cc1
Show InChI InChI=1S/C21H21N3O4/c1-2-27-18-9-7-16(8-10-18)20-22-19(23-28-20)15-5-3-14(4-6-15)11-24-12-17(13-24)21(25)26/h3-10,17H,2,11-13H2,1H3,(H,25,26)
NCI pathway
Reactome pathway
n/an/a 48n/an/an/an/an/a25
Merck Research Laboratories
Assay Description
The assay measures the displacement of [33P]-labeled sphingosine-1-phosphate (S1P) by test compounds from human S1P receptors expressed on CHO cell m...
J Med Chem 48: 6169-73 (2005)
Article DOI: 10.1021/jm0503244
BindingDB Entry DOI: 10.7270/Q26971W9