null
SMILES: Cc1ccc(cc1)-c1nc2ccccc2c(=O)o1
InChI Key: InChIKey=AUPLZGYHNMXILO-UHFFFAOYSA-N
Activity Spreadsheet -- Enzyme Inhibition Constant Data from BindingDB
Found 4 hits for monomerid = 222119
Trg + Lig
Ki
nM
ΔG°
kcal/mole
IC50
nM
Kd
nM
EC50/IC50
nM
koff
s-1
kon
M-1s-1
pHTemp
°C
Chymotrypsinogen A
(Bos taurus (bovine))
BDBM222119
(2-(4-Methylphenyl)-4H-3,1-benzoxazin-4-one (7))
Show SMILES Cc1ccc(cc1)-c1nc2ccccc2c(=O)o1
Show InChI InChI=1S/C15H11NO2/c1-10-6-8-11(9-7-10)14-16-13-5-3-2-4-12(13)15(17)18-14/h2-9H,1H3
Reactome pathway
1.64E+4n/an/an/an/an/an/an/an/a
University of Karachi
Assay Description
The change in optical density per minute (OD/min) was obtained by incorporating various concentrations of compounds over a range of substrate (SPpNA)...
Bioorg Chem 70: 210-221 (2017)
Article DOI: 10.1016/j.bioorg.2017.01.001
BindingDB Entry DOI: 10.7270/Q2QR4W00
Adenosine receptor A2a
(Rattus norvegicus (rat))
BDBM222119
(2-(4-Methylphenyl)-4H-3,1-benzoxazin-4-one (7))
Show SMILES Cc1ccc(cc1)-c1nc2ccccc2c(=O)o1
Show InChI InChI=1S/C15H11NO2/c1-10-6-8-11(9-7-10)14-16-13-5-3-2-4-12(13)15(17)18-14/h2-9H,1H3
Reactome pathway
>1.00E+5n/an/an/an/an/an/an/an/a
North-West University
Curated by ChEMBL
Assay Description
Displacement of [3H]NECA from Sprague-Dawley rat striatal membrane A2A adenosine receptor by scintillation counting analysis
Bioorg Med Chem Lett 30: (2020)
Adenosine receptor A1
(Rattus norvegicus (rat))
BDBM222119
(2-(4-Methylphenyl)-4H-3,1-benzoxazin-4-one (7))
Show SMILES Cc1ccc(cc1)-c1nc2ccccc2c(=O)o1
Show InChI InChI=1S/C15H11NO2/c1-10-6-8-11(9-7-10)14-16-13-5-3-2-4-12(13)15(17)18-14/h2-9H,1H3
Reactome pathway
>1.00E+5n/an/an/an/an/an/an/an/a
North-West University
Curated by ChEMBL
Assay Description
Displacement of [3H]DPCPX from Sprague-Dawley rat whole brain membrane A1AR by scintillation counting analysis
Bioorg Med Chem Lett 30: (2020)
Chymotrypsinogen A
(Bos taurus (bovine))
BDBM222119
(2-(4-Methylphenyl)-4H-3,1-benzoxazin-4-one (7))
Show SMILES Cc1ccc(cc1)-c1nc2ccccc2c(=O)o1
Show InChI InChI=1S/C15H11NO2/c1-10-6-8-11(9-7-10)14-16-13-5-3-2-4-12(13)15(17)18-14/h2-9H,1H3
Reactome pathway
n/an/a 2.01E+4n/an/an/an/a7.6n/a
University of Karachi
Assay Description
The α-chymotrypsin inhibition activity was evaluated in 50 mM Tris-HCl buffer pH 7.6 with 10 mM CaCl2. α-Chymotrypsin (bovine pancreas) at ...
Bioorg Chem 70: 210-221 (2017)
Article DOI: 10.1016/j.bioorg.2017.01.001
BindingDB Entry DOI: 10.7270/Q2QR4W00