null
SMILES: Cc1cccc(c1)-c1nc2cc(ccc2c(=O)o1)[N+]([O-])=O
InChI Key: InChIKey=YUVHBYMEUKMYSH-UHFFFAOYSA-N
Activity Spreadsheet -- Enzyme Inhibition Constant Data from BindingDB
Found 2 hits for monomerid = 222126
Trg + Lig
Ki
nM
ΔG°
kcal/mole
IC50
nM
Kd
nM
EC50/IC50
nM
koff
s-1
kon
M-1s-1
pHTemp
°C
Chymotrypsinogen A
(Bos taurus (bovine))
BDBM222126
(2-(3-Methylphenyl)-7-nitro-4H-3,1-benzoxazin-4-one...)
Show SMILES Cc1cccc(c1)-c1nc2cc(ccc2c(=O)o1)[N+]([O-])=O
Show InChI InChI=1S/C15H10N2O4/c1-9-3-2-4-10(7-9)14-16-13-8-11(17(19)20)5-6-12(13)15(18)21-14/h2-8H,1H3
Reactome pathway
1.62E+5n/an/an/an/an/an/an/an/a
University of Karachi
Assay Description
The change in optical density per minute (OD/min) was obtained by incorporating various concentrations of compounds over a range of substrate (SPpNA)...
Bioorg Chem 70: 210-221 (2017)
Article DOI: 10.1016/j.bioorg.2017.01.001
BindingDB Entry DOI: 10.7270/Q2QR4W00
Chymotrypsinogen A
(Bos taurus (bovine))
BDBM222126
(2-(3-Methylphenyl)-7-nitro-4H-3,1-benzoxazin-4-one...)
Show SMILES Cc1cccc(c1)-c1nc2cc(ccc2c(=O)o1)[N+]([O-])=O
Show InChI InChI=1S/C15H10N2O4/c1-9-3-2-4-10(7-9)14-16-13-8-11(17(19)20)5-6-12(13)15(18)21-14/h2-8H,1H3
Reactome pathway
n/an/a 9.41E+4n/an/an/an/a7.6n/a
University of Karachi
Assay Description
The α-chymotrypsin inhibition activity was evaluated in 50 mM Tris-HCl buffer pH 7.6 with 10 mM CaCl2. α-Chymotrypsin (bovine pancreas) at ...
Bioorg Chem 70: 210-221 (2017)
Article DOI: 10.1016/j.bioorg.2017.01.001
BindingDB Entry DOI: 10.7270/Q2QR4W00