null
SMILES: CN(C)c1ccc2C(NS(=O)(=O)c3cccc1c23)c1ccc(cc1)[N+]([O-])=O
InChI Key: InChIKey=GERILKHELPCZKW-UHFFFAOYSA-N
Activity Spreadsheet -- Enzyme Inhibition Constant Data from BindingDB
Found 1 hit for monomerid = 222186
Trg + Lig
Ki
nM
ΔG°
kcal/mole
IC50
nM
Kd
nM
EC50/IC50
nM
koff
s-1
kon
M-1s-1
pHTemp
°C
Alkaline phosphatase, tissue-nonspecific isozyme
(Bos taurus (Cattle))
BDBM222186
(6-(Dimethylamino)-3-(4'-nitrophenyl)-2,3-dihyd...)
Show SMILES CN(C)c1ccc2C(NS(=O)(=O)c3cccc1c23)c1ccc(cc1)[N+]([O-])=O
Show InChI InChI=1S/C19H17N3O4S/c1-21(2)16-11-10-15-18-14(16)4-3-5-17(18)27(25,26)20-19(15)12-6-8-13(9-7-12)22(23)24/h3-11,19-20H,1-2H3
n/an/a 110n/an/an/an/a9.837
University of Karachi
Assay Description
Alkaline phosphatase (b-TNAP, c-IAP purchased from Calzyme Laboratories, Inc. USA) inhibition assay of different cyclic sulfonamides was performed us...
Bioorg Chem 71: 10-18 (2017)
Article DOI: 10.1016/j.bioorg.2017.01.008
BindingDB Entry DOI: 10.7270/Q26Q1W36