BDBM222216 4-(4,5-Diphenyl-1H-imidazol-2-yl)-3-(4-methoxyphenyl)-1-phenyl-1H-pyrazole (2e)
SMILES: COc1ccc(cc1)-c1nn(cc1-c1nc(c([nH]1)-c1ccccc1)-c1ccccc1)-c1ccccc1
InChI Key: InChIKey=MTVKCBZVVKFTEM-UHFFFAOYSA-N
Data: 1 IC50
Activity Spreadsheet -- Enzyme Inhibition Constant Data from BindingDB
Found 1 hit for monomerid = 222216
Trg + Lig
Ki
nM
ΔG°
kcal/mole
IC50
nM
Kd
nM
EC50/IC50
nM
koff
s-1
kon
M-1s-1
pHTemp
°C
α-glucosidase
(Saccharomyces cerevisiae S288c (Baker's yeast))
BDBM222216
(4-(4,5-Diphenyl-1H-imidazol-2-yl)-3-(4-methoxyphen...)
Show SMILES COc1ccc(cc1)-c1nn(cc1-c1nc(c([nH]1)-c1ccccc1)-c1ccccc1)-c1ccccc1
Show InChI InChI=1S/C31H24N4O/c1-36-26-19-17-24(18-20-26)28-27(21-35(34-28)25-15-9-4-10-16-25)31-32-29(22-11-5-2-6-12-22)30(33-31)23-13-7-3-8-14-23/h2-21H,1H3,(H,32,33)
Reactome pathway
n/an/a 2.40E+4n/an/an/an/an/an/a
University of the Punjab; Kinnaird College for Women
Assay Description
At 37 °C, after incubation of 10 min of a reaction mixture solution of 70 μL (50 mM) phosphate buffer of 6.8 pH, 10 μL (0.5 mM) of a test c...
Bioorg Chem 71: 102-109 (2017)
Article DOI: 10.1016/j.bioorg.2017.01.017
BindingDB Entry DOI: 10.7270/Q2Z89B86