BDBM2225 2-Pyridinone derivative 5::3-[2-(naphth-2-yl)ethyl]-5-ethyl-6-methylpyridin-2(1H)-one::5-ethyl-6-methyl-3-[2-(naphthalen-2-yl)ethyl]-1,2-dihydropyridin-2-one::CHEMBL175235
SMILES: CCc1cc(CCc2ccc3ccccc3c2)c(=O)[nH]c1C
InChI Key: InChIKey=QALBKNORHKXXTG-UHFFFAOYSA-N
Data: 2 IC50
Activity Spreadsheet -- Enzyme Inhibition Constant Data from BindingDB
Found 2 hits for monomerid = 2225
Trg + Lig
Ki
nM
ΔG°
kcal/mole
IC50
nM
Kd
nM
EC50/IC50
nM
koff
s-1
kon
M-1s-1
pHTemp
°C
Human immunodeficiency virus type 1 reverse transcriptase
(Human immunodeficiency virus 1)
BDBM2225
(2-Pyridinone derivative 5 | 3-[2-(naphth-2-yl)ethy...)
Show SMILES CCc1cc(CCc2ccc3ccccc3c2)c(=O)[nH]c1C
Show InChI InChI=1S/C20H21NO/c1-3-16-13-19(20(22)21-14(16)2)11-9-15-8-10-17-6-4-5-7-18(17)12-15/h4-8,10,12-13H,3,9,11H2,1-2H3,(H,21,22)
n/an/a 8.40E+3n/an/an/an/an/an/a
Merck Reserch Laboratories
Curated by ChEMBL
Assay Description
Tested for inhibition against HIV-1 RT (used (poly)rC-(oligo)dG as the template)
J Med Chem 36: 953-66 (1993)
BindingDB Entry DOI: 10.7270/Q2JW8G28
HIV-1 Reverse Transcriptase
(Human immunodeficiency virus type 1)
BDBM2225
(2-Pyridinone derivative 5 | 3-[2-(naphth-2-yl)ethy...)
Show SMILES CCc1cc(CCc2ccc3ccccc3c2)c(=O)[nH]c1C
Show InChI InChI=1S/C20H21NO/c1-3-16-13-19(20(22)21-14(16)2)11-9-15-8-10-17-6-4-5-7-18(17)12-15/h4-8,10,12-13H,3,9,11H2,1-2H3,(H,21,22)
n/an/a 8.40E+3n/an/an/an/an/an/a
Merck Reserch Laboratories
Curated by ChEMBL
Assay Description
The IC50 of reverse transcriptase is the concentration that inhibits 50% of recombinant HIV-1 RT RNA-directed DNA polymerase activity in vitro.
J Med Chem 36: 953-66 (1993)
BindingDB Entry DOI: 10.7270/Q2JW8G28