null
SMILES: CS(=O)CCCCOc1ccc2ncc(-c3cc4ccccc4o3)n2n1
InChI Key: InChIKey=UOSFMIJOOFCUID-UHFFFAOYSA-N
Activity Spreadsheet -- Enzyme Inhibition Constant Data from BindingDB
Found 1 hit for monomerid = 223026
Trg + Lig
Ki
nM
ΔG°
kcal/mole
IC50
nM
Kd
nM
EC50/IC50
nM
koff
s-1
kon
M-1s-1
pHTemp
°C
Isoform 2 of MAP kinase-interacting serine/threonine-protein kinase 1 (MNK1a) 344D]
(Homo sapiens (Human))
BDBM223026
(US9320737, II.3)
Show SMILES CS(=O)CCCCOc1ccc2ncc(-c3cc4ccccc4o3)n2n1 |w:1.0|
Show InChI InChI=1S/C19H19N3O3S/c1-26(23)11-5-4-10-24-19-9-8-18-20-13-15(22(18)21-19)17-12-14-6-2-3-7-16(14)25-17/h2-3,6-9,12-13H,4-5,10-11H2,1H3
US Patent
n/an/a 5n/an/an/an/a7.522
BAYER INTELLECTUAL PROPERTY GMBH
US Patent
Assay Description
For the assay 50 mL of a 100 fold concentrated solution of the test compound in DMSO was pipetted into a black low volume 384 well microtiter plate (...
US Patent US9320737 (2016)
BindingDB Entry DOI: 10.7270/Q22V2F00