null
SMILES: CS(=O)(=O)CCCOc1ccc2ncc(-c3cc4ccccc4o3)n2n1
InChI Key: InChIKey=TXPLNEQLEQXZOV-UHFFFAOYSA-N
Activity Spreadsheet -- Enzyme Inhibition Constant Data from BindingDB
Found 1 hit for monomerid = 223028
Trg + Lig
Ki
nM
ΔG°
kcal/mole
IC50
nM
Kd
nM
EC50/IC50
nM
koff
s-1
kon
M-1s-1
pHTemp
°C
Isoform 2 of MAP kinase-interacting serine/threonine-protein kinase 1 (MNK1a) 344D]
(Homo sapiens (Human))
BDBM223028
(US9320737, III.1)
Show SMILES CS(=O)(=O)CCCOc1ccc2ncc(-c3cc4ccccc4o3)n2n1
Show InChI InChI=1S/C18H17N3O4S/c1-26(22,23)10-4-9-24-18-8-7-17-19-12-14(21(17)20-18)16-11-13-5-2-3-6-15(13)25-16/h2-3,5-8,11-12H,4,9-10H2,1H3
US Patent
n/an/a 5n/an/an/an/a7.522
BAYER INTELLECTUAL PROPERTY GMBH
US Patent
Assay Description
For the assay 50 mL of a 100 fold concentrated solution of the test compound in DMSO was pipetted into a black low volume 384 well microtiter plate (...
US Patent US9320737 (2016)
BindingDB Entry DOI: 10.7270/Q22V2F00