BDBM223040 US9320737, III.13
SMILES: CS(=O)(=O)CCCOc1ccc2ncc(-c3cc4cnccc4o3)n2n1
InChI Key: InChIKey=NIFVMRGIOHOGKD-UHFFFAOYSA-N
Data: 1 IC50
Activity Spreadsheet -- Enzyme Inhibition Constant Data from BindingDB
Found 1 hit for monomerid = 223040
Trg + Lig
Ki
nM
ΔG°
kcal/mole
IC50
nM
Kd
nM
EC50/IC50
nM
koff
s-1
kon
M-1s-1
pHTemp
°C
MAP kinase-interacting serine/threonine-protein kinase 1 (T344D)
(Homo sapiens (Human))
BDBM223040
(US9320737, III.13)
Show SMILES CS(=O)(=O)CCCOc1ccc2ncc(-c3cc4cnccc4o3)n2n1
Show InChI InChI=1S/C17H16N4O4S/c1-26(22,23)8-2-7-24-17-4-3-16-19-11-13(21(16)20-17)15-9-12-10-18-6-5-14(12)25-15/h3-6,9-11H,2,7-8H2,1H3
US Patent
n/an/a 28n/an/an/an/a7.522
BAYER INTELLECTUAL PROPERTY GMBH
US Patent
Assay Description
For the assay 50 mL of a 100 fold concentrated solution of the test compound in DMSO was pipetted into a black low volume 384 well microtiter plate (...
US Patent US9320737 (2016)
BindingDB Entry DOI: 10.7270/Q22V2F00