BDBM223079 (E)-N'-(Pyridin-3'-ylmethylene)isonicotinohydrazide (3i)
SMILES: O=C(N\N=C\c1cccnc1)c1ccncc1
InChI Key: InChIKey=DERMXJNBYDETST-OQLLNIDSSA-N
Data: 4 IC50
Activity Spreadsheet -- Enzyme Inhibition Constant Data from BindingDB
Found 4 hits for monomerid = 223079
Trg + Lig
Ki
nM
ΔG°
kcal/mole
IC50
nM
Kd
nM
EC50/IC50
nM
koff
s-1
kon
M-1s-1
pHTemp
°C
5'-nucleotidase
(Homo sapiens (Human))
BDBM223079
((E)-N'-(Pyridin-3'-ylmethylene)isonicotino...)
Show SMILES O=C(N\N=C\c1cccnc1)c1ccncc1
Show InChI InChI=1S/C12H10N4O/c17-12(11-3-6-13-7-4-11)16-15-9-10-2-1-5-14-8-10/h1-9H,(H,16,17)/b15-9+
n/an/a 210n/an/an/an/a7.437
Quaid-I-Azam University
Assay Description
The enzymatic assay of both human and rat ecto-5'-nucleotidase were performed with slight modifications in the previously described method. The stock...
Chem Biol Drug Des 89: 365-370 (2017)
Article DOI: 10.1111/cbdd.12861
BindingDB Entry DOI: 10.7270/Q2F47N10
Intestinal alkaline phosphatase (IAP)
(Bos taurus (Cattle))
BDBM223079
((E)-N'-(Pyridin-3'-ylmethylene)isonicotino...)
Show SMILES O=C(N\N=C\c1cccnc1)c1ccncc1
Show InChI InChI=1S/C12H10N4O/c17-12(11-3-6-13-7-4-11)16-15-9-10-2-1-5-14-8-10/h1-9H,(H,16,17)/b15-9+
n/an/a 1.46E+3n/an/an/an/a9.837
Quaid-I-Azam University
Assay Description
The assay conditions were optimized with some changes in formerly reported spectrophotometric method. The composition of assay buffer of pH 9.8 was a...
Chem Biol Drug Des 89: 365-370 (2017)
Article DOI: 10.1111/cbdd.12861
BindingDB Entry DOI: 10.7270/Q2F47N10
Tissue non-specific alkaline phosphatase (TNAP)
(Bos taurus (Cattle))
BDBM223079
((E)-N'-(Pyridin-3'-ylmethylene)isonicotino...)
Show SMILES O=C(N\N=C\c1cccnc1)c1ccncc1
Show InChI InChI=1S/C12H10N4O/c17-12(11-3-6-13-7-4-11)16-15-9-10-2-1-5-14-8-10/h1-9H,(H,16,17)/b15-9+
n/an/a 2.43E+3n/an/an/an/a9.837
Quaid-I-Azam University
Assay Description
The assay conditions were optimized with some changes in formerly reported spectrophotometric method. The composition of assay buffer of pH 9.8 was a...
Chem Biol Drug Des 89: 365-370 (2017)
Article DOI: 10.1111/cbdd.12861
BindingDB Entry DOI: 10.7270/Q2F47N10
Ecto-5'-nucleotidase (e5'NT)
(Rattus norvegicus (Rat))
BDBM223079
((E)-N'-(Pyridin-3'-ylmethylene)isonicotino...)
Show SMILES O=C(N\N=C\c1cccnc1)c1ccncc1
Show InChI InChI=1S/C12H10N4O/c17-12(11-3-6-13-7-4-11)16-15-9-10-2-1-5-14-8-10/h1-9H,(H,16,17)/b15-9+
n/an/a 3.01E+3n/an/an/an/a7.437
Quaid-I-Azam University
Assay Description
The enzymatic assay of both human and rat ecto-5'-nucleotidase were performed with slight modifications in the previously described method. The stock...
Chem Biol Drug Des 89: 365-370 (2017)
Article DOI: 10.1111/cbdd.12861
BindingDB Entry DOI: 10.7270/Q2F47N10