BDBM223114 (Z)-N'-(1-benzyl-2-oxoindolin-3-ylidene)-2-((2-oxo-2H-chromen-7-yl)oxy)acetohydrazide (5i)
SMILES: O=C(COc1ccc2ccc(=O)oc2c1)N\N=C1/C(=O)N(Cc2ccccc2)c2ccccc12
InChI Key: InChIKey=VNHLETGCKKZPSE-FVDSYPCUSA-N
Data: 2 IC50
Activity Spreadsheet -- Enzyme Inhibition Constant Data from BindingDB
Found 2 hits for monomerid = 223114
Trg + Lig
Ki
nM
ΔG°
kcal/mole
IC50
nM
Kd
nM
EC50/IC50
nM
koff
s-1
kon
M-1s-1
pHTemp
°C
Probable maltase-glucoamylase 2
(Homo sapiens)
BDBM223114
((Z)-N'-(1-benzyl-2-oxoindolin-3-ylidene)-2-((2...)
Show SMILES O=C(COc1ccc2ccc(=O)oc2c1)N\N=C1/C(=O)N(Cc2ccccc2)c2ccccc12
Show InChI InChI=1S/C26H19N3O5/c30-23(16-33-19-12-10-18-11-13-24(31)34-22(18)14-19)27-28-25-20-8-4-5-9-21(20)29(26(25)32)15-17-6-2-1-3-7-17/h1-14H,15-16H2,(H,27,30)/b28-25-
n/an/a 2.50E+3n/an/an/an/an/an/a
Babasaheb Bhimrao Ambedkar University (A Central University)
Curated by ChEMBL
Assay Description
Inhibition of alpha-glucosidase (unknown origin) using p-nitrophenyl-alpha-d-glucopyranoside as substrate preincubated for 15 mins followed by substr...
Eur J Med Chem 176: 343-377 (2019)
Article DOI: 10.1016/j.ejmech.2019.04.025
alpha-Glucosidase (alpha-Glu)
(Saccharomyces cerevisiae)
BDBM223114
((Z)-N'-(1-benzyl-2-oxoindolin-3-ylidene)-2-((2...)
Show SMILES O=C(COc1ccc2ccc(=O)oc2c1)N\N=C1/C(=O)N(Cc2ccccc2)c2ccccc12
Show InChI InChI=1S/C26H19N3O5/c30-23(16-33-19-12-10-18-11-13-24(31)34-22(18)14-19)27-28-25-20-8-4-5-9-21(20)29(26(25)32)15-17-6-2-1-3-7-17/h1-14H,15-16H2,(H,27,30)/b28-25-
Reactome pathway
n/an/a 1.41E+4n/an/an/an/a6.8n/a
Jishou University
Assay Description
The test compounds were dissolved in DMSO to prepare the required distributing concentration. α-Glucosidase inhibitory activity was assayed usin...
Chem Biol Drug Des 89: 456-463 (2017)
Article DOI: 10.1111/cbdd.12867
BindingDB Entry DOI: 10.7270/Q25M64KX