null
SMILES: COc1cc(cnc1C(=O)C1CC1C(O)=O)N(CC1CC1)Cc1cccc(c1C)C(F)(F)F
InChI Key: InChIKey=JWHZXRBKSPWAMR-UHFFFAOYSA-N
Activity Spreadsheet -- Enzyme Inhibition Constant Data from BindingDB
Found 2 hits for monomerid = 223245
Trg + Lig
Ki
nM
ΔG°
kcal/mole
IC50
nM
Kd
nM
EC50/IC50
nM
koff
s-1
kon
M-1s-1
pHTemp
°C
Leukotriene C4 synthase
(Homo sapiens (Human))
BDBM223245
(2-(5-((Cyclopropylmethyl)(2-methyl-3-(trifluoromet...)
Show SMILES COc1cc(cnc1C(=O)C1CC1C(O)=O)N(CC1CC1)Cc1cccc(c1C)C(F)(F)F
Show InChI InChI=1S/C24H25F3N2O4/c1-13-15(4-3-5-19(13)24(25,26)27)12-29(11-14-6-7-14)16-8-20(33-2)21(28-10-16)22(30)17-9-18(17)23(31)32/h3-5,8,10,14,17-18H,6-7,9,11-12H2,1-2H3,(H,31,32)
Reactome pathway
US Patent
n/an/a 88n/an/an/an/an/an/a
ASTRAZENECA AB
US Patent
Assay Description
In the assay, LTC4 synthase catalyses the reaction where the substrate LTA4 methyl ester is converted to LTC4 methyl ester.In order to obtain IC50-va...
US Patent US9657001 (2017)
BindingDB Entry DOI: 10.7270/Q2SJ1NPG
Leukotriene C4 synthase
(Homo sapiens (Human))
BDBM223245
(2-(5-((Cyclopropylmethyl)(2-methyl-3-(trifluoromet...)
Show SMILES COc1cc(cnc1C(=O)C1CC1C(O)=O)N(CC1CC1)Cc1cccc(c1C)C(F)(F)F
Show InChI InChI=1S/C24H25F3N2O4/c1-13-15(4-3-5-19(13)24(25,26)27)12-29(11-14-6-7-14)16-8-20(33-2)21(28-10-16)22(30)17-9-18(17)23(31)32/h3-5,8,10,14,17-18H,6-7,9,11-12H2,1-2H3,(H,31,32)
Reactome pathway
US Patent
n/an/a 88n/an/an/an/a7.8n/a
Astrazeneca Ab
US Patent
Assay Description
In the assay, LTC4 synthase catalyses the reaction where the substrate LTA4 is converted to LTC4. Recombinant human LTC4 synthase is expressed in Pic...
US Patent US20160326143 (2016)
BindingDB Entry DOI: 10.7270/Q2W66JN5