BDBM223289 (1S,2S)-2-({5-[(5-Chloro-2,4-difluorophenyl)(propyl)amino]-3-methoxypyrazin-2-yl}carbonyl)cyclopropanecarboxylic acid::US20160326143, 64
SMILES: CCCN(c1cnc(C(=O)[C@H]2C[C@@H]2C(O)=O)c(OC)n1)c1cc(Cl)c(F)cc1F
InChI Key: InChIKey=JBSBGXXISRQIMP-UWVGGRQHSA-N
Data: 1 IC50
Activity Spreadsheet -- Enzyme Inhibition Constant Data from BindingDB
Found 1 hit for monomerid = 223289
Trg + Lig
Ki
nM
ΔG°
kcal/mole
IC50
nM
Kd
nM
EC50/IC50
nM
koff
s-1
kon
M-1s-1
pHTemp
°C
Leukotriene C4 synthase
(Homo sapiens (Human))
BDBM223289
((1S,2S)-2-({5-[(5-Chloro-2,4-difluorophenyl)(propy...)
Show SMILES CCCN(c1cnc(C(=O)[C@H]2C[C@@H]2C(O)=O)c(OC)n1)c1cc(Cl)c(F)cc1F
Show InChI InChI=1S/C19H18ClF2N3O4/c1-3-4-25(14-6-11(20)12(21)7-13(14)22)15-8-23-16(18(24-15)29-2)17(26)9-5-10(9)19(27)28/h6-10H,3-5H2,1-2H3,(H,27,28)/t9-,10-/m0/s1
Reactome pathway
US Patent
n/an/a 0.483n/an/an/an/a7.5n/a
Astrazeneca Ab
US Patent
Assay Description
In the assay, LTC4 synthase catalyses the reaction where the substrate LTA4 methyl ester is converted to LTC4 methyl ester. In order to obtain IC50-v...
US Patent US20160326143 (2016)
BindingDB Entry DOI: 10.7270/Q2W66JN5