BDBM2233 2-Pyridinone derivative 13::3-[2-(Furo[3,2-c]pyridin-2-yl)ethyl]-5-ethyl-6-methylpyridin-2(1H)-one::5-ethyl-3-(2-{furo[3,2-c]pyridin-2-yl}ethyl)-6-methyl-1,2-dihydropyridin-2-one::CHEMBL177074
SMILES: CCc1cc(CCc2cc3cnccc3o2)c(=O)[nH]c1C
InChI Key: InChIKey=RWAURRBPVDZMNK-UHFFFAOYSA-N
Data: 2 IC50
Activity Spreadsheet -- Enzyme Inhibition Constant Data from BindingDB
Found 2 hits for monomerid = 2233
Trg + Lig
Ki
nM
ΔG°
kcal/mole
IC50
nM
Kd
nM
EC50/IC50
nM
koff
s-1
kon
M-1s-1
pHTemp
°C
Human immunodeficiency virus type 1 reverse transcriptase
(Human immunodeficiency virus 1)
BDBM2233
(2-Pyridinone derivative 13 | 3-[2-(Furo[3,2-c]pyri...)
Show SMILES CCc1cc(CCc2cc3cnccc3o2)c(=O)[nH]c1C
Show InChI InChI=1S/C17H18N2O2/c1-3-12-8-13(17(20)19-11(12)2)4-5-15-9-14-10-18-7-6-16(14)21-15/h6-10H,3-5H2,1-2H3,(H,19,20)
n/an/a 1.35E+4n/an/an/an/an/an/a
Merck Reserch Laboratories
Curated by ChEMBL
Assay Description
Tested for inhibition against HIV-1 RT (used (poly)rC-(oligo)dG as the template)
J Med Chem 36: 953-66 (1993)
BindingDB Entry DOI: 10.7270/Q2JW8G28
HIV-1 Reverse Transcriptase
(Human immunodeficiency virus type 1)
BDBM2233
(2-Pyridinone derivative 13 | 3-[2-(Furo[3,2-c]pyri...)
Show SMILES CCc1cc(CCc2cc3cnccc3o2)c(=O)[nH]c1C
Show InChI InChI=1S/C17H18N2O2/c1-3-12-8-13(17(20)19-11(12)2)4-5-15-9-14-10-18-7-6-16(14)21-15/h6-10H,3-5H2,1-2H3,(H,19,20)
n/an/a 1.35E+4n/an/an/an/an/an/a
Merck Reserch Laboratories
Curated by ChEMBL
Assay Description
The IC50 of reverse transcriptase is the concentration that inhibits 50% of recombinant HIV-1 RT RNA-directed DNA polymerase activity in vitro.
J Med Chem 36: 953-66 (1993)
BindingDB Entry DOI: 10.7270/Q2JW8G28