null
SMILES: COc1cc(NS(=O)(=O)c2ccc(NS(=O)(=O)c3c(C)noc3C)cc2)nc(OC)n1
InChI Key: InChIKey=SSDWSTAYENJABB-UHFFFAOYSA-N
Activity Spreadsheet -- Enzyme Inhibition Constant Data from BindingDB
Found 2 hits for monomerid = 223474
Trg + Lig
Ki
nM
ΔG°
kcal/mole
IC50
nM
Kd
nM
EC50/IC50
nM
koff
s-1
kon
M-1s-1
pHTemp
°C
RAC-alpha serine/threonine-protein kinase [1-123]
(Homo sapiens (Human))
BDBM223474
(US9320734, 415)
Show SMILES COc1cc(NS(=O)(=O)c2ccc(NS(=O)(=O)c3c(C)noc3C)cc2)nc(OC)n1
Show InChI InChI=1S/C17H19N5O7S2/c1-10-16(11(2)29-20-10)31(25,26)21-12-5-7-13(8-6-12)30(23,24)22-14-9-15(27-3)19-17(18-14)28-4/h5-9,21H,1-4H3,(H,18,19,22)
US Patent
n/an/a 1.00E+3n/an/an/an/an/an/a
Board of Regents, The University of Texas System; Arizona Board of Regents on behalf of the University of Arizona
US Patent
Assay Description
Inhibition of AKT was measured by Western blots using specific antibodies against phospho-Ser473-AKT in HT-29 lung cancer cells. Inhibition of the ph...
US Patent US9320734 (2016)
BindingDB Entry DOI: 10.7270/Q2QF8RRM
RAC-alpha serine/threonine-protein kinase [1-123]
(Homo sapiens (Human))
BDBM223474
(US9320734, 415)
Show SMILES COc1cc(NS(=O)(=O)c2ccc(NS(=O)(=O)c3c(C)noc3C)cc2)nc(OC)n1
Show InChI InChI=1S/C17H19N5O7S2/c1-10-16(11(2)29-20-10)31(25,26)21-12-5-7-13(8-6-12)30(23,24)22-14-9-15(27-3)19-17(18-14)28-4/h5-9,21H,1-4H3,(H,18,19,22)
US Patent
n/an/an/a 6.27E+3n/an/an/an/an/a
Board of Regents, The University of Texas System; Arizona Board of Regents on behalf of the University of Arizona
US Patent
Assay Description
SPR interaction analyses were performed with a Biacore 2000, using Biacore 2000 Control Software v3.2 and BIAevaluation v4.1 analysis software (Biaco...
US Patent US9320734 (2016)
BindingDB Entry DOI: 10.7270/Q2QF8RRM