BDBM22382 (3aS,6aR)-5-(hexan-2-yl)-N,4-diphenyl-1,2,3,3a,6,6a-hexahydropentalen-3a-amine::bicyclo[3.3.0]-oct-2-ene, 5j
SMILES: [H][C@]12CCC[C@@]1(Nc1ccccc1)C(=C(C2)C(C)CCCC)c1ccccc1
InChI Key: InChIKey=XQYQZKJQEBBBBS-PJISVWDJSA-N
Data: 2 EC50
Activity Spreadsheet -- Enzyme Inhibition Constant Data from BindingDB
Found 2 hits for monomerid = 22382
Trg + Lig
Ki
nM
ΔG°
kcal/mole
IC50
nM
Kd
nM
EC50/IC50
nM
koff
s-1
kon
M-1s-1
pHTemp
°C
Steroidogenic Factor 1
(Homo sapiens (Human))
BDBM22382
((3aS,6aR)-5-(hexan-2-yl)-N,4-diphenyl-1,2,3,3a,6,6...)
Show SMILES [H][C@]12CCC[C@@]1(Nc1ccccc1)C(=C(C2)C(C)CCCC)c1ccccc1 |r,c:15|
Show InChI InChI=1S/C26H33N/c1-3-4-12-20(2)24-19-22-15-11-18-26(22,27-23-16-9-6-10-17-23)25(24)21-13-7-5-8-14-21/h5-10,13-14,16-17,20,22,27H,3-4,11-12,15,18-19H2,1-2H3/t20?,22-,26+/m1/s1
Reactome pathway
n/an/an/an/a 130n/an/an/an/a
University of Southampton
Assay Description
The screen utilizes a ligand mediated co-factor interaction between purified bacterial expressed ligand binding domain of human SF1 and a peptide der...
J Med Chem 49: 6652-5 (2006)
Article DOI: 10.1021/jm060990k
BindingDB Entry DOI: 10.7270/Q2930RGT
Liver Receptor Homolog 1
(Homo sapiens (Human))
BDBM22382
((3aS,6aR)-5-(hexan-2-yl)-N,4-diphenyl-1,2,3,3a,6,6...)
Show SMILES [H][C@]12CCC[C@@]1(Nc1ccccc1)C(=C(C2)C(C)CCCC)c1ccccc1 |r,c:15|
Show InChI InChI=1S/C26H33N/c1-3-4-12-20(2)24-19-22-15-11-18-26(22,27-23-16-9-6-10-17-23)25(24)21-13-7-5-8-14-21/h5-10,13-14,16-17,20,22,27H,3-4,11-12,15,18-19H2,1-2H3/t20?,22-,26+/m1/s1
Reactome pathway
n/an/an/an/a 70n/an/a7.522
University of Southampton
Assay Description
The screen utilizes a ligand mediated co-factor interaction between purified bacterial expressed ligand binding domain of human LRH1 and a TIF2-deriv...
J Med Chem 49: 6652-5 (2006)
Article DOI: 10.1021/jm060990k
BindingDB Entry DOI: 10.7270/Q2930RGT