BDBM22398 2-[(1R,2S,3S,5S)-3-(4-chlorophenyl)-8-methyl-8-azabicyclo[3.2.1]octan-2-yl]-5-phenyl-1,3-thiazole::RTI-219::WIN 35,065-2 Analogue, 4a
SMILES: CN1[C@H]2CC[C@@H]1[C@H]([C@H](C2)c1ccc(Cl)cc1)c1ncc(s1)-c1ccccc1
InChI Key: InChIKey=WEUZYHQNGQDGAB-HIUFNZKISA-N
Data: 5 KI  1 IC50  3 EC50
Activity Spreadsheet -- Enzyme Inhibition Constant Data from BindingDB
Found 6 hits for monomerid = 22398
Trg + Lig
Ki
nM
ΔG°
kcal/mole
IC50
nM
Kd
nM
EC50/IC50
nM
koff
s-1
kon
M-1s-1
pHTemp
°C
Sodium-dependent dopamine transporter
(Homo sapiens (Human))
BDBM22398
(2-[(1R,2S,3S,5S)-3-(4-chlorophenyl)-8-methyl-8-aza...)
Show SMILES CN1[C@H]2CC[C@@H]1[C@H]([C@H](C2)c1ccc(Cl)cc1)c1ncc(s1)-c1ccccc1 |TLB:0:1:4.3:7.8.6|
Show InChI InChI=1S/C23H23ClN2S/c1-26-18-11-12-20(26)22(19(13-18)15-7-9-17(24)10-8-15)23-25-14-21(27-23)16-5-3-2-4-6-16/h2-10,14,18-20,22H,11-13H2,1H3/t18-,19+,20+,22-/m0/s1
NCI pathway
Reactome pathway
18n/an/an/a 158n/an/an/an/a
Research Triangle Institute
Assay Description
Membranes were preincubated with drugs before the addition of [125I]RTI-55. The reaction was terminated by filtration through Wallac Filtermat A filt...
J Med Chem 50: 3686-95 (2007)
Article DOI: 10.1021/jm0703035
BindingDB Entry DOI: 10.7270/Q25D8Q4T
Sodium-dependent noradrenaline transporter
(Homo sapiens (Human))
BDBM22398
(2-[(1R,2S,3S,5S)-3-(4-chlorophenyl)-8-methyl-8-aza...)
Show SMILES CN1[C@H]2CC[C@@H]1[C@H]([C@H](C2)c1ccc(Cl)cc1)c1ncc(s1)-c1ccccc1 |TLB:0:1:4.3:7.8.6|
Show InChI InChI=1S/C23H23ClN2S/c1-26-18-11-12-20(26)22(19(13-18)15-7-9-17(24)10-8-15)23-25-14-21(27-23)16-5-3-2-4-6-16/h2-10,14,18-20,22H,11-13H2,1H3/t18-,19+,20+,22-/m0/s1
Reactome pathway
1.84E+3n/an/an/a 750n/an/an/an/a
Research Triangle Institute
Assay Description
Membranes were preincubated with drugs before the addition of [125I]RTI-55. The reaction was terminated by filtration through Wallac Filtermat A filt...
J Med Chem 50: 3686-95 (2007)
Article DOI: 10.1021/jm0703035
BindingDB Entry DOI: 10.7270/Q25D8Q4T
Sodium-dependent serotonin transporter
(Rattus norvegicus (rat))
BDBM22398
(2-[(1R,2S,3S,5S)-3-(4-chlorophenyl)-8-methyl-8-aza...)
Show SMILES CN1[C@H]2CC[C@@H]1[C@H]([C@H](C2)c1ccc(Cl)cc1)c1ncc(s1)-c1ccccc1 |TLB:0:1:4.3:7.8.6|
Show InChI InChI=1S/C23H23ClN2S/c1-26-18-11-12-20(26)22(19(13-18)15-7-9-17(24)10-8-15)23-25-14-21(27-23)16-5-3-2-4-6-16/h2-10,14,18-20,22H,11-13H2,1H3/t18-,19+,20+,22-/m0/s1
>2.00E+3>-7.77n/an/an/an/an/a7.425
Research Triangle Institute
Assay Description
Brains from male Sprague-Dawley rats were removed, dissected, and rapidly frozen. Ligand binding experiments were conducted in assay tubes containing...
J Med Chem 50: 3686-95 (2007)
Article DOI: 10.1021/jm0703035
BindingDB Entry DOI: 10.7270/Q25D8Q4T
Sodium-dependent serotonin transporter
(Homo sapiens (Human))
BDBM22398
(2-[(1R,2S,3S,5S)-3-(4-chlorophenyl)-8-methyl-8-aza...)
Show SMILES CN1[C@H]2CC[C@@H]1[C@H]([C@H](C2)c1ccc(Cl)cc1)c1ncc(s1)-c1ccccc1 |TLB:0:1:4.3:7.8.6|
Show InChI InChI=1S/C23H23ClN2S/c1-26-18-11-12-20(26)22(19(13-18)15-7-9-17(24)10-8-15)23-25-14-21(27-23)16-5-3-2-4-6-16/h2-10,14,18-20,22H,11-13H2,1H3/t18-,19+,20+,22-/m0/s1
2.67E+3n/an/an/a 2.71E+3n/an/an/an/a
Research Triangle Institute
Assay Description
Membranes were preincubated with drugs before the addition of [125I]RTI-55. The reaction was terminated by filtration through Wallac Filtermat A filt...
J Med Chem 50: 3686-95 (2007)
Article DOI: 10.1021/jm0703035
BindingDB Entry DOI: 10.7270/Q25D8Q4T
Transporter
(Rattus norvegicus (rat))
BDBM22398
(2-[(1R,2S,3S,5S)-3-(4-chlorophenyl)-8-methyl-8-aza...)
Show SMILES CN1[C@H]2CC[C@@H]1[C@H]([C@H](C2)c1ccc(Cl)cc1)c1ncc(s1)-c1ccccc1 |TLB:0:1:4.3:7.8.6|
Show InChI InChI=1S/C23H23ClN2S/c1-26-18-11-12-20(26)22(19(13-18)15-7-9-17(24)10-8-15)23-25-14-21(27-23)16-5-3-2-4-6-16/h2-10,14,18-20,22H,11-13H2,1H3/t18-,19+,20+,22-/m0/s1
Reactome pathway
8.56E+3n/an/an/an/an/an/an/an/a
Research Triangle Institute
Assay Description
Brains from male Sprague-Dawley rats were removed, dissected, and rapidly frozen. Ligand binding experiments were conducted in assay tubes containing...
J Med Chem 50: 3686-95 (2007)
Article DOI: 10.1021/jm0703035
BindingDB Entry DOI: 10.7270/Q25D8Q4T
Sodium-dependent dopamine transporter
(Rattus norvegicus (rat))
BDBM22398
(2-[(1R,2S,3S,5S)-3-(4-chlorophenyl)-8-methyl-8-aza...)
Show SMILES CN1[C@H]2CC[C@@H]1[C@H]([C@H](C2)c1ccc(Cl)cc1)c1ncc(s1)-c1ccccc1 |TLB:0:1:4.3:7.8.6|
Show InChI InChI=1S/C23H23ClN2S/c1-26-18-11-12-20(26)22(19(13-18)15-7-9-17(24)10-8-15)23-25-14-21(27-23)16-5-3-2-4-6-16/h2-10,14,18-20,22H,11-13H2,1H3/t18-,19+,20+,22-/m0/s1
Reactome pathway
n/an/a 5.70n/an/an/an/a7.44
Research Triangle Institute
Assay Description
Brains from male Sprague-Dawley rats were removed, dissected, and rapidly frozen. Ligand binding experiments were conducted in assay tubes containing...
J Med Chem 50: 3686-95 (2007)
Article DOI: 10.1021/jm0703035
BindingDB Entry DOI: 10.7270/Q25D8Q4T