BDBM224018 (+)-TAN-67
SMILES: CN1CC[C@]2(Cc3nc4ccccc4cc3C[C@@H]2C1)c1cccc(O)c1
InChI Key: InChIKey=LEPBHAAYNPPRRA-XXBNENTESA-N
Data: 2 EC50
Activity Spreadsheet -- Enzyme Inhibition Constant Data from BindingDB
Found 2 hits for monomerid = 224018
Trg + Lig
Ki
nM
ΔG°
kcal/mole
IC50
nM
Kd
nM
EC50/IC50
nM
koff
s-1
kon
M-1s-1
pHTemp
°C
Mas-related G protein-coupled receptor X2 (MRGPRX2)
(Homo sapiens (Human))
BDBM224018
((+)-TAN-67)
Show SMILES CN1CC[C@]2(Cc3nc4ccccc4cc3C[C@@H]2C1)c1cccc(O)c1
Show InChI InChI=1S/C23H24N2O/c1-25-10-9-23(18-6-4-7-20(26)13-18)14-22-17(12-19(23)15-25)11-16-5-2-3-8-21(16)24-22/h2-8,11,13,19,26H,9-10,12,14-15H2,1H3/t19-,23+/m1/s1
n/an/an/an/a 430n/an/a7.430
University of North Carolina
Assay Description
HTLA cells (HEK-T cells stably expressing a β-arrestin2-TEV fusion protein and a tTa-dependent luciferase reporter) were maintained in DMEM (Cor...
Nat Chem Biol 13: 529-536 (2017)
Article DOI: 10.1038/nchembio.2334
BindingDB Entry DOI: 10.7270/Q20R9N82
Mas-related G protein-coupled receptor X2 (MRGPRX2)
(Homo sapiens (Human))
BDBM224018
((+)-TAN-67)
Show SMILES CN1CC[C@]2(Cc3nc4ccccc4cc3C[C@@H]2C1)c1cccc(O)c1
Show InChI InChI=1S/C23H24N2O/c1-25-10-9-23(18-6-4-7-20(26)13-18)14-22-17(12-19(23)15-25)11-16-5-2-3-8-21(16)24-22/h2-8,11,13,19,26H,9-10,12,14-15H2,1H3/t19-,23+/m1/s1
n/an/an/an/a 290n/an/a7.430
University of North Carolina
Assay Description
MRGPRX2 stable cells were maintained in DMEM containing 10% FBS, 100 μg/ml hygromycin B, and 15 μg/ml blasticidin. For the calcium mobiliza...
Nat Chem Biol 13: 529-536 (2017)
Article DOI: 10.1038/nchembio.2334
BindingDB Entry DOI: 10.7270/Q20R9N82