BDBM224022 Codeine-6-glucuronide::Codeine-6G
SMILES: COc1ccc2C[C@@H]3[C@@H]4C=C[C@H](O[C@@H]5O[C@@H]([C@@H](O)[C@H](O)[C@H]5O)C(O)=O)[C@@H]5Oc1c2[C@]45CCN3C
InChI Key: InChIKey=CRWVOYRJXPDBPM-HSCJLHHPSA-N
Data: 1 EC50
Activity Spreadsheet -- Enzyme Inhibition Constant Data from BindingDB
Found 1 hit for monomerid = 224022
Trg + Lig
Ki
nM
ΔG°
kcal/mole
IC50
nM
Kd
nM
EC50/IC50
nM
koff
s-1
kon
M-1s-1
pHTemp
°C
Mas-related G protein-coupled receptor X2 (MRGPRX2)
(Homo sapiens (Human))
BDBM224022
(Codeine-6-glucuronide | Codeine-6G)
Show SMILES COc1ccc2C[C@@H]3[C@@H]4C=C[C@H](O[C@@H]5O[C@@H]([C@@H](O)[C@H](O)[C@H]5O)C(O)=O)[C@@H]5Oc1c2[C@]45CCN3C |c:9|
Show InChI InChI=1S/C24H29NO9/c1-25-8-7-24-11-4-6-14(32-23-18(28)16(26)17(27)20(34-23)22(29)30)21(24)33-19-13(31-2)5-3-10(15(19)24)9-12(11)25/h3-6,11-12,14,16-18,20-21,23,26-28H,7-9H2,1-2H3,(H,29,30)/t11-,12+,14-,16-,17-,18+,20-,21-,23+,24-/m0/s1
n/an/an/an/a 4.40E+4n/an/a7.430
University of North Carolina
Assay Description
HTLA cells (HEK-T cells stably expressing a β-arrestin2-TEV fusion protein and a tTa-dependent luciferase reporter) were maintained in DMEM (Cor...
Nat Chem Biol 13: 529-536 (2017)
Article DOI: 10.1038/nchembio.2334
BindingDB Entry DOI: 10.7270/Q20R9N82