BDBM22411 2-[(1R,2S,3S,5S)-8-methyl-3-(4-methylphenyl)-8-azabicyclo[3.2.1]octan-2-yl]-5-(4-nitrophenyl)-1,3-thiazole::WIN 35,065-2 Analogue, 4o
SMILES: CN1[C@H]2CC[C@@H]1[C@H]([C@H](C2)c1ccc(C)cc1)c1ncc(s1)-c1ccc(cc1)[N+]([O-])=O
InChI Key: InChIKey=JERGWFJDGWCPDJ-GNXKAVGDSA-N
Data: 5 KI  1 IC50  3 EC50
Activity Spreadsheet -- Enzyme Inhibition Constant Data from BindingDB
Found 6 hits for monomerid = 22411
Trg + Lig
Ki
nM
ΔG°
kcal/mole
IC50
nM
Kd
nM
EC50/IC50
nM
koff
s-1
kon
M-1s-1
pHTemp
°C
Sodium-dependent dopamine transporter
(Homo sapiens (Human))
BDBM22411
(2-[(1R,2S,3S,5S)-8-methyl-3-(4-methylphenyl)-8-aza...)
Show SMILES CN1[C@H]2CC[C@@H]1[C@H]([C@H](C2)c1ccc(C)cc1)c1ncc(s1)-c1ccc(cc1)[N+]([O-])=O |TLB:0:1:4.3:7.8.6|
Show InChI InChI=1S/C24H25N3O2S/c1-15-3-5-16(6-4-15)20-13-19-11-12-21(26(19)2)23(20)24-25-14-22(30-24)17-7-9-18(10-8-17)27(28)29/h3-10,14,19-21,23H,11-13H2,1-2H3/t19-,20+,21+,23-/m0/s1
NCI pathway
Reactome pathway
140n/an/an/a 197n/an/an/an/a
Research Triangle Institute
Assay Description
Membranes were preincubated with drugs before the addition of [125I]RTI-55. The reaction was terminated by filtration through Wallac Filtermat A filt...
J Med Chem 50: 3686-95 (2007)
Article DOI: 10.1021/jm0703035
BindingDB Entry DOI: 10.7270/Q25D8Q4T
Sodium-dependent serotonin transporter
(Homo sapiens (Human))
BDBM22411
(2-[(1R,2S,3S,5S)-8-methyl-3-(4-methylphenyl)-8-aza...)
Show SMILES CN1[C@H]2CC[C@@H]1[C@H]([C@H](C2)c1ccc(C)cc1)c1ncc(s1)-c1ccc(cc1)[N+]([O-])=O |TLB:0:1:4.3:7.8.6|
Show InChI InChI=1S/C24H25N3O2S/c1-15-3-5-16(6-4-15)20-13-19-11-12-21(26(19)2)23(20)24-25-14-22(30-24)17-7-9-18(10-8-17)27(28)29/h3-10,14,19-21,23H,11-13H2,1-2H3/t19-,20+,21+,23-/m0/s1
1.64E+3n/an/an/a 3.17E+3n/an/an/an/a
Research Triangle Institute
Assay Description
Membranes were preincubated with drugs before the addition of [125I]RTI-55. The reaction was terminated by filtration through Wallac Filtermat A filt...
J Med Chem 50: 3686-95 (2007)
Article DOI: 10.1021/jm0703035
BindingDB Entry DOI: 10.7270/Q25D8Q4T
Sodium-dependent serotonin transporter
(Rattus norvegicus (rat))
BDBM22411
(2-[(1R,2S,3S,5S)-8-methyl-3-(4-methylphenyl)-8-aza...)
Show SMILES CN1[C@H]2CC[C@@H]1[C@H]([C@H](C2)c1ccc(C)cc1)c1ncc(s1)-c1ccc(cc1)[N+]([O-])=O |TLB:0:1:4.3:7.8.6|
Show InChI InChI=1S/C24H25N3O2S/c1-15-3-5-16(6-4-15)20-13-19-11-12-21(26(19)2)23(20)24-25-14-22(30-24)17-7-9-18(10-8-17)27(28)29/h3-10,14,19-21,23H,11-13H2,1-2H3/t19-,20+,21+,23-/m0/s1
1.69E+3n/an/an/an/an/an/an/an/a
Research Triangle Institute
Assay Description
Brains from male Sprague-Dawley rats were removed, dissected, and rapidly frozen. Ligand binding experiments were conducted in assay tubes containing...
J Med Chem 50: 3686-95 (2007)
Article DOI: 10.1021/jm0703035
BindingDB Entry DOI: 10.7270/Q25D8Q4T
Sodium-dependent noradrenaline transporter
(Homo sapiens (Human))
BDBM22411
(2-[(1R,2S,3S,5S)-8-methyl-3-(4-methylphenyl)-8-aza...)
Show SMILES CN1[C@H]2CC[C@@H]1[C@H]([C@H](C2)c1ccc(C)cc1)c1ncc(s1)-c1ccc(cc1)[N+]([O-])=O |TLB:0:1:4.3:7.8.6|
Show InChI InChI=1S/C24H25N3O2S/c1-15-3-5-16(6-4-15)20-13-19-11-12-21(26(19)2)23(20)24-25-14-22(30-24)17-7-9-18(10-8-17)27(28)29/h3-10,14,19-21,23H,11-13H2,1-2H3/t19-,20+,21+,23-/m0/s1
Reactome pathway
1.97E+3n/an/an/a 1.55E+3n/an/an/an/a
Research Triangle Institute
Assay Description
Membranes were preincubated with drugs before the addition of [125I]RTI-55. The reaction was terminated by filtration through Wallac Filtermat A filt...
J Med Chem 50: 3686-95 (2007)
Article DOI: 10.1021/jm0703035
BindingDB Entry DOI: 10.7270/Q25D8Q4T
Transporter
(Rattus norvegicus (rat))
BDBM22411
(2-[(1R,2S,3S,5S)-8-methyl-3-(4-methylphenyl)-8-aza...)
Show SMILES CN1[C@H]2CC[C@@H]1[C@H]([C@H](C2)c1ccc(C)cc1)c1ncc(s1)-c1ccc(cc1)[N+]([O-])=O |TLB:0:1:4.3:7.8.6|
Show InChI InChI=1S/C24H25N3O2S/c1-15-3-5-16(6-4-15)20-13-19-11-12-21(26(19)2)23(20)24-25-14-22(30-24)17-7-9-18(10-8-17)27(28)29/h3-10,14,19-21,23H,11-13H2,1-2H3/t19-,20+,21+,23-/m0/s1
Reactome pathway
>2.00E+3n/an/an/an/an/an/an/an/a
Research Triangle Institute
Assay Description
Brains from male Sprague-Dawley rats were removed, dissected, and rapidly frozen. Ligand binding experiments were conducted in assay tubes containing...
J Med Chem 50: 3686-95 (2007)
Article DOI: 10.1021/jm0703035
BindingDB Entry DOI: 10.7270/Q25D8Q4T
Sodium-dependent dopamine transporter
(Rattus norvegicus (rat))
BDBM22411
(2-[(1R,2S,3S,5S)-8-methyl-3-(4-methylphenyl)-8-aza...)
Show SMILES CN1[C@H]2CC[C@@H]1[C@H]([C@H](C2)c1ccc(C)cc1)c1ncc(s1)-c1ccc(cc1)[N+]([O-])=O |TLB:0:1:4.3:7.8.6|
Show InChI InChI=1S/C24H25N3O2S/c1-15-3-5-16(6-4-15)20-13-19-11-12-21(26(19)2)23(20)24-25-14-22(30-24)17-7-9-18(10-8-17)27(28)29/h3-10,14,19-21,23H,11-13H2,1-2H3/t19-,20+,21+,23-/m0/s1
Reactome pathway
n/an/a 41n/an/an/an/a7.44
Research Triangle Institute
Assay Description
Brains from male Sprague-Dawley rats were removed, dissected, and rapidly frozen. Ligand binding experiments were conducted in assay tubes containing...
J Med Chem 50: 3686-95 (2007)
Article DOI: 10.1021/jm0703035
BindingDB Entry DOI: 10.7270/Q25D8Q4T