BDBM224783 US9328120, 13
SMILES: FC1(F)CCC(CC1)n1ncc2c1nc([nH]c2=O)[C@H]1CC[C@@H]1c1ncccn1
InChI Key:
Data: 1 IC50
Activity Spreadsheet -- Enzyme Inhibition Constant Data from BindingDB
Found 1 hit for monomerid = 224783
Trg + Lig
Ki
nM
ΔG°
kcal/mole
IC50
nM
Kd
nM
EC50/IC50
nM
koff
s-1
kon
M-1s-1
pHTemp
°C
Phosphodiesterase 9A (PDE9A2)
(Homo sapiens (Human))
BDBM224783
(US9328120, 13)
Show SMILES FC1(F)CCC(CC1)n1ncc2c1nc([nH]c2=O)[C@H]1CC[C@@H]1c1ncccn1 |r|
US Patent
n/an/a 7n/an/an/an/an/a25
Boehringer Ingelheim International GmbH
US Patent
Assay Description
The PDE9A2 enzymatic activity assay was run as scintillation proximity assay (SPA), in general according to the protocol of the manufacturer (GE Heal...
US Patent US9328120 (2016)
BindingDB Entry DOI: 10.7270/Q2V123MS