BDBM2251 2-Pyridinone derivative 31::3-[ 2-(7-Fluorobenzoxazol-2-yl)ethyl]-5-ethyl-6-methylpyridine-2(1H)-thione::5-ethyl-3-[2-(7-fluoro-1,3-benzoxazol-2-yl)ethyl]-6-methyl-1,2-dihydropyridine-2-thione::CHEMBL172583
SMILES: CCc1cc(CCc2nc3cccc(F)c3o2)c(=S)[nH]c1C
InChI Key: InChIKey=QZOGWNOXUZLRLL-UHFFFAOYSA-N
Data: 2 IC50
Activity Spreadsheet -- Enzyme Inhibition Constant Data from BindingDB
Found 2 hits for monomerid = 2251
Trg + Lig
Ki
nM
ΔG°
kcal/mole
IC50
nM
Kd
nM
EC50/IC50
nM
koff
s-1
kon
M-1s-1
pHTemp
°C
Human immunodeficiency virus type 1 reverse transcriptase
(Human immunodeficiency virus 1)
BDBM2251
(2-Pyridinone derivative 31 | 3-[ 2-(7-Fluorobenzox...)
Show SMILES CCc1cc(CCc2nc3cccc(F)c3o2)c(=S)[nH]c1C
Show InChI InChI=1S/C17H17FN2OS/c1-3-11-9-12(17(22)19-10(11)2)7-8-15-20-14-6-4-5-13(18)16(14)21-15/h4-6,9H,3,7-8H2,1-2H3,(H,19,22)
n/an/a 43n/an/an/an/an/an/a
Merck Reserch Laboratories
Curated by ChEMBL
Assay Description
Tested for inhibition against HIV-1 RT (used (poly)rC-(oligo)dG as the template)
J Med Chem 36: 953-66 (1993)
BindingDB Entry DOI: 10.7270/Q2JW8G28
HIV-1 Reverse Transcriptase
(Human immunodeficiency virus type 1)
BDBM2251
(2-Pyridinone derivative 31 | 3-[ 2-(7-Fluorobenzox...)
Show SMILES CCc1cc(CCc2nc3cccc(F)c3o2)c(=S)[nH]c1C
Show InChI InChI=1S/C17H17FN2OS/c1-3-11-9-12(17(22)19-10(11)2)7-8-15-20-14-6-4-5-13(18)16(14)21-15/h4-6,9H,3,7-8H2,1-2H3,(H,19,22)
n/an/a 43n/an/an/an/an/an/a
Merck Reserch Laboratories
Curated by ChEMBL
Assay Description
The IC50 of reverse transcriptase is the concentration that inhibits 50% of recombinant HIV-1 RT RNA-directed DNA polymerase activity in vitro.
J Med Chem 36: 953-66 (1993)
BindingDB Entry DOI: 10.7270/Q2JW8G28