BDBM225311 CS3
SMILES: NC(=O)c1ccc(cc1)C(=O)Nc1cc([nH]n1)C1CC1
InChI Key: InChIKey=HGEJNHUGVPFHIF-UHFFFAOYSA-N
Data: 2 Kd  2 Koff  2 Kon  2 ITC
PDB links: 1 PDB ID matches this monomer.
Activity Spreadsheet -- Enzyme Inhibition Constant Data from BindingDB
Found 6 hits for monomerid = 225311
Trg + Lig
Ki
nM
ΔG°
kcal/mole
IC50
nM
Kd
nM
EC50/IC50
nM
koff
s-1
kon
M-1s-1
pHTemp
°C
Cyclin-dependent kinase 2
(Homo sapiens (Human))
BDBM225311
(CS3)
Show SMILES NC(=O)c1ccc(cc1)C(=O)Nc1cc([nH]n1)C1CC1
Show InChI InChI=1S/C14H14N4O2/c15-13(19)9-3-5-10(6-4-9)14(20)16-12-7-11(17-18-12)8-1-2-8/h3-8H,1-2H2,(H2,15,19)(H2,16,17,18,20)
NCI pathway
Reactome pathway
D3R
n/an/an/a 362n/an/an/an/an/a
D3R
Assay Description
OctetRed_Method2
D3R 219: (2015)
BindingDB Entry DOI: 10.7270/Q25B01BH
Cyclin-dependent kinase 2
(Homo sapiens (Human))
BDBM225311
(CS3)
Show SMILES NC(=O)c1ccc(cc1)C(=O)Nc1cc([nH]n1)C1CC1
Show InChI InChI=1S/C14H14N4O2/c15-13(19)9-3-5-10(6-4-9)14(20)16-12-7-11(17-18-12)8-1-2-8/h3-8H,1-2H2,(H2,15,19)(H2,16,17,18,20)
NCI pathway
Reactome pathway
D3R
n/an/an/an/an/an/a 1.83E+5n/an/a
D3R
Assay Description
OctetRed_Method3
D3R 219: (2015)
BindingDB Entry DOI: 10.7270/Q25B01BH
Cyclin-dependent kinase 2
(Homo sapiens (Human))
BDBM225311
(CS3)
Show SMILES NC(=O)c1ccc(cc1)C(=O)Nc1cc([nH]n1)C1CC1
Show InChI InChI=1S/C14H14N4O2/c15-13(19)9-3-5-10(6-4-9)14(20)16-12-7-11(17-18-12)8-1-2-8/h3-8H,1-2H2,(H2,15,19)(H2,16,17,18,20)
NCI pathway
Reactome pathway
D3R
n/an/an/an/an/a 0.259n/an/an/a
D3R
Assay Description
OctetRed_Method3
D3R 220: (2015)
BindingDB Entry DOI: 10.7270/Q21J98M7
Cyclin-dependent kinase 2
(Homo sapiens (Human))
BDBM225311
(CS3)
Show SMILES NC(=O)c1ccc(cc1)C(=O)Nc1cc([nH]n1)C1CC1
Show InChI InChI=1S/C14H14N4O2/c15-13(19)9-3-5-10(6-4-9)14(20)16-12-7-11(17-18-12)8-1-2-8/h3-8H,1-2H2,(H2,15,19)(H2,16,17,18,20)
NCI pathway
Reactome pathway
D3R
n/an/an/a 808n/an/an/an/an/a
D3R
Assay Description
OctetRed_Method1
D3R 220: (2015)
BindingDB Entry DOI: 10.7270/Q21J98M7
Cyclin-dependent kinase 2
(Homo sapiens (Human))
BDBM225311
(CS3)
Show SMILES NC(=O)c1ccc(cc1)C(=O)Nc1cc([nH]n1)C1CC1
Show InChI InChI=1S/C14H14N4O2/c15-13(19)9-3-5-10(6-4-9)14(20)16-12-7-11(17-18-12)8-1-2-8/h3-8H,1-2H2,(H2,15,19)(H2,16,17,18,20)
NCI pathway
Reactome pathway
D3R
n/an/an/an/an/an/a 3.35E+5n/an/a
D3R
Assay Description
OctetRed_Method3
D3R 220: (2015)
BindingDB Entry DOI: 10.7270/Q21J98M7
Cyclin-dependent kinase 2
(Homo sapiens (Human))
BDBM225311
(CS3)
Show SMILES NC(=O)c1ccc(cc1)C(=O)Nc1cc([nH]n1)C1CC1
Show InChI InChI=1S/C14H14N4O2/c15-13(19)9-3-5-10(6-4-9)14(20)16-12-7-11(17-18-12)8-1-2-8/h3-8H,1-2H2,(H2,15,19)(H2,16,17,18,20)
NCI pathway
Reactome pathway
D3R
n/an/an/an/an/a 0.0610n/an/an/a
D3R
Assay Description
OctetRed_Method3
D3R 219: (2015)
BindingDB Entry DOI: 10.7270/Q25B01BH
Activity Spreadsheet -- ITC Data from BindingDB
Found 2 hits for monomerid = 225311
Cell (A)Syringe (B)Cell
Syringe
Cell + Syr
ΔG°
kcal/mole
-TΔS°
kcal/mole
ΔH°
kcal/mole
log KpHTemp
°C
Cyclin-dependent kinase 2
(Homo sapiens (Human))
BDBM225311
JPEG
(CS3)
-8.74402-12.86.42n/a24.9
D3R
D3R 219: (2015)
Cyclin-dependent kinase 2
(Homo sapiens (Human))
BDBM225311
JPEG
(CS3)
-8.309.40-17.76.09n/a24.9
D3R
D3R 220: (2015)