BDBM22539 4-({3-[2-(naphthalen-1-yl)ethynyl]phenyl}methyl)-1H-imidazole::4-Benzyl-1H-imidazole derivative, 20
SMILES: C(c1cnc[nH]1)c1cccc(c1)C#Cc1cccc2ccccc12
InChI Key: InChIKey=HBAUWQWDRYUNGJ-UHFFFAOYSA-N
Data: 1 KI
Activity Spreadsheet -- Enzyme Inhibition Constant Data from BindingDB
Found 1 hit for monomerid = 22539
Trg + Lig
Ki
nM
ΔG°
kcal/mole
IC50
nM
Kd
nM
EC50/IC50
nM
koff
s-1
kon
M-1s-1
pHTemp
°C
Histamine H3 receptor
(Homo sapiens (Human))
BDBM22539
(4-({3-[2-(naphthalen-1-yl)ethynyl]phenyl}methyl)-1...)
Show SMILES C(c1cnc[nH]1)c1cccc(c1)C#Cc1cccc2ccccc12
Show InChI InChI=1S/C22H16N2/c1-2-10-22-19(7-1)8-4-9-20(22)12-11-17-5-3-6-18(13-17)14-21-15-23-16-24-21/h1-10,13,15-16H,14H2,(H,23,24)
Reactome pathway
1.74E+3 -7.85n/an/an/an/an/a7.425
VU University Amsterdam
Assay Description
Ligand displacement assays were performed on CHO cells membranes expressing hH3R. Retained radioactivity was determined by liquid scintillation count...
J Med Chem 51: 2944-53 (2008)
Article DOI: 10.1021/jm7014149
BindingDB Entry DOI: 10.7270/Q24F1P2W