BDBM22543 2-[4-(1H-imidazol-4-ylmethyl)phenyl]-4,4-dimethyl-4,5-dihydro-1,3-oxazole::4-Benzyl-1H-imidazole derivative, 11
SMILES: CC1(C)COC(=N1)c1ccc(Cc2cnc[nH]2)cc1
InChI Key: InChIKey=NSUJUQRJDQTZEV-UHFFFAOYSA-N
Data: 1 KI  1 Other
Activity Spreadsheet -- Enzyme Inhibition Constant Data from BindingDB
Found 2 hits for monomerid = 22543
Trg + Lig
Ki
nM
ΔG°
kcal/mole
IC50
nM
Kd
nM
EC50/IC50
nM
koff
s-1
kon
M-1s-1
pHTemp
°C
Histamine H3 receptor
(Homo sapiens (Human))
BDBM22543
(2-[4-(1H-imidazol-4-ylmethyl)phenyl]-4,4-dimethyl-...)
Show SMILES CC1(C)COC(=N1)c1ccc(Cc2cnc[nH]2)cc1 |c:5|
Show InChI InChI=1S/C15H17N3O/c1-15(2)9-19-14(18-15)12-5-3-11(4-6-12)7-13-8-16-10-17-13/h3-6,8,10H,7,9H2,1-2H3,(H,16,17)
Reactome pathway
2.51E+3 -7.63n/an/an/an/an/a7.425
VU University Amsterdam
Assay Description
Ligand displacement assays were performed on CHO cells membranes expressing hH3R. Retained radioactivity was determined by liquid scintillation count...
J Med Chem 51: 2944-53 (2008)
Article DOI: 10.1021/jm7014149
BindingDB Entry DOI: 10.7270/Q24F1P2W
Histamine H4 receptor
(Homo sapiens (Human))
BDBM22543
(2-[4-(1H-imidazol-4-ylmethyl)phenyl]-4,4-dimethyl-...)
Show SMILES CC1(C)COC(=N1)c1ccc(Cc2cnc[nH]2)cc1 |c:5|
Show InChI InChI=1S/C15H17N3O/c1-15(2)9-19-14(18-15)12-5-3-11(4-6-12)7-13-8-16-10-17-13/h3-6,8,10H,7,9H2,1-2H3,(H,16,17)
Reactome pathway
n/an/an/an/an/an/an/a7.425
VU University Amsterdam
Assay Description
Ligand displacement assays were performed on CHO cells membranes expressing hH4R. Retained radioactivity was determined by liquid scintillation count...
J Med Chem 51: 2944-53 (2008)
Article DOI: 10.1021/jm7014149
BindingDB Entry DOI: 10.7270/Q24F1P2W