null
SMILES: OC(=O)CCCCN(c1ccnc(Nc2ccc3CNS(=O)(=O)c3c2)n1)c1cccc2[nH]ncc12
InChI Key: InChIKey=RIXCIODPPQAVLX-UHFFFAOYSA-N
Activity Spreadsheet -- Enzyme Inhibition Constant Data from BindingDB
Found 3 hits for monomerid = 225523
Trg + Lig
Ki
nM
ΔG°
kcal/mole
IC50
nM
Kd
nM
EC50/IC50
nM
koff
s-1
kon
M-1s-1
pHTemp
°C
Tyrosine-protein kinase SYK [355-635]
(Homo sapiens (Human))
BDBM225523
(GTC000229A)
Show SMILES OC(=O)CCCCN(c1ccnc(Nc2ccc3CNS(=O)(=O)c3c2)n1)c1cccc2[nH]ncc12
Show InChI InChI=1S/C23H23N7O4S/c31-22(32)6-1-2-11-30(19-5-3-4-18-17(19)14-25-29-18)21-9-10-24-23(28-21)27-16-8-7-15-13-26-35(33,34)20(15)12-16/h3-5,7-10,12,14,26H,1-2,6,11,13H2,(H,25,29)(H,31,32)(H,24,27,28)
D3R
n/an/a 1.41n/an/an/an/an/an/a
D3R
Assay Description
SYK assay_HTRF
D3R 225: (2015)
BindingDB Entry DOI: 10.7270/Q2CV4GM1
Tyrosine-protein kinase SYK [355-635]
(Homo sapiens (Human))
BDBM225523
(GTC000229A)
Show SMILES OC(=O)CCCCN(c1ccnc(Nc2ccc3CNS(=O)(=O)c3c2)n1)c1cccc2[nH]ncc12
Show InChI InChI=1S/C23H23N7O4S/c31-22(32)6-1-2-11-30(19-5-3-4-18-17(19)14-25-29-18)21-9-10-24-23(28-21)27-16-8-7-15-13-26-35(33,34)20(15)12-16/h3-5,7-10,12,14,26H,1-2,6,11,13H2,(H,25,29)(H,31,32)(H,24,27,28)
D3R
n/an/a 2.47n/an/an/an/an/an/a
D3R
Assay Description
SYK assay_HTRF
D3R 225: (2015)
BindingDB Entry DOI: 10.7270/Q2CV4GM1
Tyrosine-protein kinase SYK [355-635]
(Homo sapiens (Human))
BDBM225523
(GTC000229A)
Show SMILES OC(=O)CCCCN(c1ccnc(Nc2ccc3CNS(=O)(=O)c3c2)n1)c1cccc2[nH]ncc12
Show InChI InChI=1S/C23H23N7O4S/c31-22(32)6-1-2-11-30(19-5-3-4-18-17(19)14-25-29-18)21-9-10-24-23(28-21)27-16-8-7-15-13-26-35(33,34)20(15)12-16/h3-5,7-10,12,14,26H,1-2,6,11,13H2,(H,25,29)(H,31,32)(H,24,27,28)
D3R
n/an/a 1.19n/an/an/an/an/an/a
D3R
Assay Description
SYK assay_HTRF
D3R 225: (2015)
BindingDB Entry DOI: 10.7270/Q2CV4GM1